OBJECTID,ROAD_NAME,LOCATION,EASTING,NORTHING,WARD,MODEL,CONDITION,DEFECTS,COMMENTS,LASTUPDATED,FREQUENCY,SEQUENCE,BINID
16748,PUDSEY ROAD, ,425088.09,433366.86,FARNLEY & WORTLEY, , , , ,12/07/2011 00:00, ,0,2613
16749,PUDSEY ROAD, ,424751.77,433650.9,FARNLEY & WORTLEY, , , , ,12/07/2011 00:00, ,0,2615
16750,CHURCH STREET, ,436559.07,429195.8,ROTHWELL,METAL SQUARE,GOOD,NONE, ,22/09/2020 00:00,DAILY,0,2617
16751,PYMONT DRIVE, ,435288.1,428843.77,ROTHWELL,METAL SQUARE,GOOD,NONE, ,22/09/2020 00:00,DAILY,0,2619
16753,QUEEN STREET, ,426454.33,427591.68,MORLEY SOUTH, , , , ,12/07/2011 00:00, ,0,2631
16754,QUEEN STREET, ,426447.12,427654.96,MORLEY SOUTH, , , , ,12/07/2011 00:00, ,0,2637
16755,QUEENSHILL GARDENS, ,430015.26,438955.17,MOORTOWN, , , , ,12/07/2018 00:00,THURSDAY,0,2652
16756,QUEENSWAY,OPP SAINSBURYS,420621.29,441466.32,OTLEY & YEADON,METAL TWIN,POOR,NO LOCK, ,11/06/2018 00:00,WED/SAT,0,2653
16757,QUEENSWOOD DRIVE, ,426293.9,436774.08,KIRKSTALL,METAL TWIN,POOR,NO LOCK, ,12/07/2018 00:00,MON/FRI,0,2668
16758,QUEENSWOOD DRIVE, ,426622.1,436235.28,KIRKSTALL,METAL TWIN,POOR,NO LOCK, ,12/07/2018 00:00,DAILY,0,2669
16759,QUEENSWOOD DRIVE, ,426433.47,436363.01,KIRKSTALL,METAL TWIN,POOR,NO LOCK, ,12/07/2018 00:00,MON/FRI,0,2674
16760,RAKEHILL ROAD, ,437604.91,437224.18,HAREWOOD, , , , ,12/07/2011 00:00, ,0,2684
16761,RAKEHILL ROAD, ,438061.13,437250.93,HAREWOOD, , , , ,12/07/2011 00:00, ,0,2685
16762,RAYNEL GARDENS, ,426095.31,439762.09,WEETWOOD, , , , ,12/07/2011 00:00,MON/WED/FRI,0,2689
16763,RICHARDSHAW LANE, ,422021.96,434347.19,CALVERLEY & FARSLEY,METAL SQUARE,GOOD,NONE, ,28/08/2018 00:00,MONDAY,0,2706
16764,RING ROAD CROSSGATES,O/S TRAVELLERS REST,436068.09,434878.86,KILLINGBECK & SEACROFT, , , , ,12/07/2011 00:00, ,0,2712
16765,RING ROAD FARNLEY, ,424107.23,433515.52,PUDSEY, , , , ,28/08/2018 00:00,THURSDAY,0,2714
16766,RING ROAD FARNLEY, ,424855.58,433364.35,FARNLEY & WORTLEY, , , , ,12/07/2011 00:00, ,0,2715
16767,RING ROAD FARNLEY, ,425427.98,432914.64,FARNLEY & WORTLEY, , , , ,12/07/2011 00:00, ,0,2718
16768,RING ROAD FARNLEY, ,425440.91,432867.32,FARNLEY & WORTLEY, , , , ,12/07/2011 00:00, ,0,2723
16769,RING ROAD MIDDLETON, ,431834.35,429320.04,MIDDLETON PARK,METAL SQUARE,GOOD,NONE, ,12/07/2018 00:00,WEDNESDAY,0,2727
16770,RODLEY LANE, ,422258.91,436353,CALVERLEY & FARSLEY,METAL TWIN,FAIR,NONE, ,28/08/2018 00:00,SATURDAY,0,2742
16771,ROKER LANE, ,423707.94,431610.18,PUDSEY, , , , ,28/08/2018 00:00,DAILY,0,2747
16772,ROKER LANE, ,423751.09,431615.85,PUDSEY, , , , ,28/08/2018 00:00,DAILY,0,2748
16773,ROUNDHAY ROAD, ,432367.03,436338.55,ROUNDHAY, , , , ,12/07/2018 00:00,WEDNESDAY,0,2755
16774,ROUNDHAY ROAD, ,431691.86,435413.98,GIPTON & HAREHILLS, , , , ,12/07/2018 00:00,MON/THU,0,2760
16775,ROUNDHAY ROAD, ,432549.34,436767.11,ROUNDHAY, , , , ,12/07/2018 00:00,DAILY,0,2763
16776,ROUNDHAY ROAD, ,432596.27,436836.75,ROUNDHAY, , , , ,12/07/2018 00:00,DAILY,0,2766
16777,ROUNDHAY ROAD, ,432655.32,436888.22,ROUNDHAY, , , , ,12/07/2018 00:00,DAILY,0,2773
16778,ROUNDHAY ROAD, ,431867.68,435693.49,GIPTON & HAREHILLS, , , , ,12/07/2018 00:00,DAILY,0,2779
16779,SALISBURY STREET, ,420395.23,437050.59,CALVERLEY & FARSLEY,METAL TWIN,FAIR,NONE, ,28/08/2018 00:00,SATURDAY,0,2798
16780,SAVILLE GREEN, ,431967.11,433704.81,BURMANTOFTS & RICHMOND HILL, , , , ,12/07/2011 00:00, ,0,2802
16781,SAVILLE GREEN, ,431907.72,433699.89,BURMANTOFTS & RICHMOND HILL, , , , ,12/07/2011 00:00, ,0,2803
16782,SAXON MOUNT, ,429591.29,439095.49,ALWOODLEY, , , , ,12/07/2011 00:00, ,0,2814
16783,SAXON ROAD, ,429254.52,438675.07,ALWOODLEY, , , , ,12/07/2011 00:00, ,0,2815
16883,DEWSBURY ROAD, ,430024.43,430973.26,HUNSLET & RIVERSIDE,METAL SQUARE,FAIR,NONE, ,12/09/2018 00:00,DAILY,0,879
16884,DEWSBURY ROAD, ,429062.73,429957.45,BEESTON & HOLBECK, , , , ,12/07/2011 00:00, ,0,896
17052,WAKEFIELD ROAD,OPP SPORTS CENTRE,436163.25,427715.29,ROTHWELL,METAL SQUARE,GOOD,NONE, ,22/09/2020 00:00,DAILY,0,3480
17075,WETHERBY ROAD, ,439819.54,447240,WETHERBY, , , , ,12/07/2011 00:00, ,0,3618
17076,WETHERBY ROAD, ,440783.01,447752.85,WETHERBY, , , , ,12/07/2011 00:00, ,0,3626
17077,WETHERBY ROAD, ,440498.62,447683.84,WETHERBY, , , , ,12/07/2011 00:00, ,0,3630
17078,WHINCOVER DRIVE, ,425827.02,432193.89,FARNLEY & WORTLEY, , , , ,12/07/2011 00:00, ,0,3632
17079,WHITEHALL ROAD, ,426542.47,431706.71,FARNLEY & WORTLEY, , , , ,12/07/2011 00:00, ,0,3645
17080,WICKHAM AVENUE, ,442038.06,445489.43,WETHERBY, , , , ,12/07/2011 00:00, ,0,3663
15843,DULVERTON GROVE, ,427426.08,430382.17,BEESTON & HOLBECK, , , , ,12/07/2011 00:00, ,0,936
16005,COMMERCIAL STREET, ,434516.09,428128.89,ROTHWELL,METAL SQUARE,GOOD,NONE, ,22/09/2020 00:00,DAILY,0,2533
16021,QUEEN STREET, ,426323.78,427878.57,MORLEY SOUTH, , , , ,12/07/2011 00:00, ,0,2644
16022,QUEENS ROAD,O/SSHOPS BOTH SIDES OF THE ROAD,428431.96,435050.11,HEADINGLEY & HYDE PARK,METAL TWIN,FAIR,NONE, ,25/06/2018 00:00,DAILY,0,2646
16023,QUEENSHILL AVENUE, ,430145.62,438870.75,MOORTOWN, , , , ,12/07/2018 00:00,THURSDAY,0,2650
16024,QUEENSWAY, ,426106.24,427727.58,MORLEY SOUTH, , , , ,12/07/2011 00:00, ,0,2665
16025,QUEENSWAY, ,426295.81,427913.9,MORLEY SOUTH, , , , ,12/07/2011 00:00, ,0,2666
16026,QUEENSWOOD DRIVE, ,426606.6,436246.5,KIRKSTALL,METAL TWIN,POOR,NO LOCK, ,12/07/2018 00:00,DAILY,0,2670
16027,RAGLAN ROAD, ,429318.73,435157.59,LITTLE LONDON & WOODHOUSE,METAL TWIN,FAIR,NONE, ,22/02/2019 00:00,SUNDAY,0,2679
16028,RAINCLIFFE ROAD,O/S SCHOOL,432199.08,433464.77,BURMANTOFTS & RICHMOND HILL, , , , ,12/07/2011 00:00, ,0,2681
16029,RAYNEL APPROACH, ,426099.4,439551.53,WEETWOOD, , , , ,12/07/2011 00:00,MON/WED/FRI,0,2687
16030,RAYNEL APPROACH, ,426047.43,439490.28,WEETWOOD, , , , ,12/07/2011 00:00,MON/WED/FRI,0,2688
16031,RAYNVILLE ROAD, ,425719.86,435071.92,ARMLEY,METAL SQUARE,GOOD,NONE, ,12/08/2018 00:00,MON/THU/SAT,0,2694
16032,RAYNVILLE ROAD, ,425590.59,435061.06,ARMLEY,METAL TWIN,FAIR,NONE, ,12/08/2018 00:00,MON/THU/SAT,0,2695
16033,REGENT STREET, ,430552.61,437201.36,CHAPEL ALLERTON, , , , ,12/07/2018 00:00,SUNDAY,0,2700
16034,RING ROAD FARNLEY, ,425268.66,432958.65,FARNLEY & WORTLEY, , , , ,12/07/2011 00:00, ,0,2716
16035,RING ROAD FARNLEY, ,425090.07,433132.45,FARNLEY & WORTLEY, , , , ,12/07/2011 00:00, ,0,2720
16036,ROBIN LANE, ,422402.68,433334.92,PUDSEY,METAL SQUARE,GOOD,NONE, ,28/08/2018 00:00,DAILY,0,2738
16037,ROKER LANE, ,423736.22,431623.63,PUDSEY, , , , ,28/08/2018 00:00,DAILY,0,2749
16038,ROKER LANE, ,423961.24,431623.63,FARNLEY & WORTLEY, , , , ,12/07/2011 00:00, ,0,2750
16039,ROUNDHAY ROAD, ,432111,436067.72,ROUNDHAY, , , , ,12/07/2018 00:00,WEDNESDAY,0,2753
16040,ROUNDHAY ROAD, ,431929.87,435794.22,GIPTON & HAREHILLS, , , , ,12/07/2018 00:00,DAILY,0,2757
16041,ROUNDHAY ROAD, ,431966.48,435858.3,GIPTON & HAREHILLS, , , , ,12/07/2018 00:00,DAILY,0,2759
16042,ROUNDHAY ROAD, ,432600.82,436817.07,ROUNDHAY, , , , ,12/07/2018 00:00,DAILY,0,2764
16043,ROUNDHAY ROAD, ,432700.74,436877.63,ROUNDHAY, , , , ,12/07/2018 00:00,DAILY,0,2769
16044,ROUNDHAY ROAD, ,432641.69,436888.22,ROUNDHAY, , , , ,12/07/2018 00:00,DAILY,0,2770
16045,ROUNDHAY ROAD, ,431566.16,435187.73,GIPTON & HAREHILLS, , , , ,12/07/2018 00:00,MON/THU,0,2775
16046,ROUNDHAY ROAD, ,432020.86,435936.36,GIPTON & HAREHILLS, , , , ,12/07/2018 00:00,MON/THU,0,2781
16047,SANDFORD ROAD, ,426569.85,435362.63,KIRKSTALL,METAL TWIN,GOOD,NONE, ,12/07/2018 00:00,WED/SUN,0,2800
16048,SANDHILL MOUNT, ,430996.02,440094.16,ALWOODLEY, , , , ,12/07/2011 00:00, ,0,2801
16049,LEA FARM DRIVE, ,425934.7,436729.18,KIRKSTALL,METAL SQUARE,GOOD,NONE, ,12/07/2018 00:00,MON/FRI,0,1710
16050,LEEDS ROAD,BUS STOP O/S THEATRE BAR,441970.64,427636.38,KIPPAX & METHLEY,METAL TWIN,FAIR,NONE, ,16/04/2019 00:00,SATURDAY,0,1731
16051,LEEDS ROAD,O/S GENERAL STORE,440756.27,428649.69,KIPPAX & METHLEY,PLASTIC ROUND,FAIR,NONE, ,16/04/2019 00:00,SATURDAY,0,1733
16052,LEEDS ROAD,O/S SCHOOL,441010.34,431318.29,KIPPAX & METHLEY,METAL SQUARE,GOOD,NONE, ,16/04/2019 00:00,TUESDAY,0,1734
16053,LEEDS ROAD, ,433369.07,425652.6,ARDSLEY & ROBIN HOOD, , , , ,12/07/2011 00:00, ,0,1737
16054,LEEDS ROAD, ,433257.15,426166.41,ARDSLEY & ROBIN HOOD, , , , ,12/07/2011 00:00, ,0,1740
16055,LEEDS ROAD, ,432694.17,426751.45,ARDSLEY & ROBIN HOOD, , , , ,12/07/2011 00:00, ,0,1741
16056,LEEDS ROAD, ,432505.94,427411.09,ARDSLEY & ROBIN HOOD, , , , ,12/07/2011 00:00, ,0,1746
16057,LEEDS ROAD, ,432575.46,428199.61,ARDSLEY & ROBIN HOOD, , , , ,12/07/2011 00:00, ,0,1748
16058,LEEDS ROAD, ,439840.2,436786.02,HAREWOOD, , , , ,12/07/2011 00:00, ,0,1760
16059,LEEDS ROAD, ,439961.67,437064.85,HAREWOOD, , , , ,12/07/2011 00:00, ,0,1761
16060,LEEDS ROAD, ,440775.79,428651.84,KIPPAX & METHLEY,METAL SQUARE,GOOD,NONE, ,16/04/2019 00:00,SATURDAY,0,1771
16061,LEEDS ROAD, ,441700.61,427910.78,KIPPAX & METHLEY,PLASTIC POST,POOR,NONE, ,16/04/2019 00:00,SATURDAY,0,1781
16062,LEEDS ROAD,AT BUS STOP,425687.53,443015.56,ADEL & WHARFEDALE,METAL SQUARE,GOOD,NONE, ,11/06/2018 00:00,TUE/THU,0,1796
16063,LEEDS ROAD,AT BUS STOP,419636.41,441573.75,GUISELEY & RAWDON,METAL SQUARE,GOOD,NONE, ,12/07/2018 00:00,MON/THU/SUN,0,1801
16064,LEEDS ROAD,CNR BIRCH RD,441246.15,431119.02,KIPPAX & METHLEY,METAL SQUARE,GOOD,NONE, ,16/04/2019 00:00,TUESDAY,0,1809
16065,LIDGETT LANE, ,431410.15,438140.59,ROUNDHAY, , , , ,12/07/2018 00:00,DAILY,0,1834
16066,LIDGETT LANE, ,431397.23,438143.28,ROUNDHAY, , , , ,12/07/2018 00:00,DAILY,0,1835
16067,LIDGETT LANE, ,431583.45,437919.22,ROUNDHAY, , , , ,12/07/2018 00:00,WEDNESDAY,0,1840
16068,LIDGETT LANE, ,431621.3,437851.09,ROUNDHAY, , , , ,12/07/2018 00:00,WEDNESDAY,0,1842
16069,LIDGETT LANE, ,431657.63,436713.32,ROUNDHAY, , , , ,12/07/2018 00:00,WEDNESDAY,0,1845
16070,LIDGETT LANE,O/S GLEDHOW PRIM,431650.06,437507.42,ROUNDHAY, , , , ,12/07/2018 00:00,WEDNESDAY,0,1846
16071,LINCOLN GREEN ROAD, ,431309.22,434099.13,BURMANTOFTS & RICHMOND HILL, , , , ,12/07/2011 00:00, ,0,1851
16072,LINCOLN GREEN ROAD, ,431292.4,434117.82,BURMANTOFTS & RICHMOND HILL, , , , ,12/07/2011 00:00, ,0,1852
16073,LINCOLN GREEN ROAD, ,431287.73,434104.74,BURMANTOFTS & RICHMOND HILL, , , , ,12/07/2011 00:00, ,0,1853
16074,LINCOLN GREEN ROAD, ,431268.09,434112.32,BURMANTOFTS & RICHMOND HILL, , , , ,12/07/2011 00:00, ,0,1854
16075,LINCOLN GREEN ROAD, ,431094.39,434239.59,BURMANTOFTS & RICHMOND HILL, , , , ,12/07/2011 00:00, ,0,1857
16076,LINCOMBE DRIVE, ,431026.19,437571.35,ROUNDHAY, , , , ,12/07/2018 00:00,WEDNESDAY,0,1870
16077,LINCOMBE DRIVE, ,431302.91,437402.96,ROUNDHAY, , , , ,12/07/2018 00:00,WEDNESDAY,0,1872
16078,LINDSEY ROAD, ,431328.95,434194.47,BURMANTOFTS & RICHMOND HILL, , , , ,12/07/2011 00:00, ,0,1873
16079,LITTLEMOOR ROAD, ,422379.31,432644.24,PUDSEY, , , , ,28/08/2018 00:00,DAILY,0,1882
16080,LITTLEMOOR ROAD, ,422429.18,432787.8,PUDSEY, , , , ,28/08/2018 00:00,DAILY,0,1884
16507,YORK ROAD,GUIDED BUS LANES,431317.23,433684.94,BURMANTOFTS & RICHMOND HILL, , , , ,12/07/2011 00:00, ,0,3753
16508,YORK ROAD, ,431826.94,433643.91,BURMANTOFTS & RICHMOND HILL, , , , ,12/07/2011 00:00, ,0,3757
16509,YORK ROAD, ,432162.42,433614.84,BURMANTOFTS & RICHMOND HILL, , , , ,12/07/2011 00:00, ,0,3758
16510,SOUTHWOOD GATE,ON SMALL GREEN,436219.59,435599.37,CROSSGATES & WHINMOOR,METAL SQUARE,GOOD,NONE, ,01/06/2019 00:00,MON/FRI,0,3149
16511,YORK ROAD,BUS STOP,432660.62,433871.98,BURMANTOFTS & RICHMOND HILL, , , , ,12/07/2011 00:00, ,0,3763
16512,YORK ROAD,FLYOVER BRIDGE,433070.64,433979.37,BURMANTOFTS & RICHMOND HILL, , , , ,12/07/2011 00:00, ,0,3771
16513,YORK ROAD, ,435706.79,435967.26,KILLINGBECK & SEACROFT, , , , ,12/07/2011 00:00, ,0,3773
16514,YORK ROAD, ,435722.56,436006.87,KILLINGBECK & SEACROFT, , , , ,12/07/2011 00:00, ,0,3774
16412,CEMETERY ROAD, ,429167.29,431606.11,BEESTON & HOLBECK, , , , ,12/07/2011 00:00, ,0,596
16321,BONDGATE, ,420280.71,445425.61,OTLEY & YEADON, , , , ,11/06/2018 00:00,DAILY,0,291
16322,BOROUGHGATE, ,420320.65,445556.71,OTLEY & YEADON,METAL SQUARE,GOOD,NONE, ,11/06/2018 00:00,DAILY,0,295
16323,BOSTON ROAD, ,440468.3,447631.56,WETHERBY, , , , ,12/07/2011 00:00, ,0,298
16324,BOSTON ROAD, ,440315.13,447946.27,WETHERBY, , , , ,12/07/2011 00:00, ,0,301
16325,BOSTON ROAD, ,440562.4,447995.93,WETHERBY, , , , ,12/07/2011 00:00, ,0,302
16326,BOSTON ROAD, ,440532.08,447960.91,WETHERBY, , , , ,12/07/2011 00:00, ,0,306
16327,BOSTON ROAD, ,440507.51,447980.77,WETHERBY, , , , ,12/07/2011 00:00, ,0,307
16328,BOSTON ROAD, ,440414.98,448028.87,WETHERBY, , , , ,12/07/2011 00:00, ,0,314
16329,BOSTON ROAD, ,442784.69,445005.67,WETHERBY, , , , ,12/07/2011 00:00, ,0,316
16330,BRACKENWOOD DRIVE, ,431622.81,437409.02,ROUNDHAY, , , , ,12/07/2018 00:00,WEDNESDAY,0,326
16331,BRACKENWOOD DRIVE, ,431356.36,437966.15,ROUNDHAY, , , , ,12/07/2018 00:00,WEDNESDAY,0,328
16332,BRACKENWOOD DRIVE, ,431368.47,437966.15,ROUNDHAY, , , , ,12/07/2018 00:00,WEDNESDAY,0,329
16333,BRACKENWOOD DRIVE, ,431408.64,438121.35,ROUNDHAY, , , , ,12/07/2018 00:00,DAILY,0,330
16334,BRADFORD ROAD,O/S ST MARYS SCHOOL,417962.81,443126.92,GUISELEY & RAWDON,CONCRETE ROUND,POOR,NO LINER, ,12/07/2018 00:00,MON/THU/SUN,0,333
16335,BRADFORD ROAD, ,429441.73,425822.18,ARDSLEY & ROBIN HOOD, , , , ,12/07/2011 00:00, ,0,344
16336,BRADFORD ROAD, ,428797.47,426005.18,ARDSLEY & ROBIN HOOD, , , , ,12/07/2011 00:00, ,0,348
16337,BRADFORD ROAD, ,429359.95,425866.27,ARDSLEY & ROBIN HOOD, , , , ,12/07/2011 00:00, ,0,351
16338,BRADFORD ROAD, ,429896.64,425162.32,ARDSLEY & ROBIN HOOD, , , , ,12/07/2011 00:00, ,0,353
16339,BRADFORD ROAD, ,429850.87,425315.82,ARDSLEY & ROBIN HOOD, , , , ,12/07/2011 00:00, ,0,354
16340,BRADFORD ROAD, ,429736.8,425624.24,ARDSLEY & ROBIN HOOD, , , , ,12/07/2011 00:00, ,0,355
16341,BRADFORD ROAD, ,421202.62,434455.83,CALVERLEY & FARSLEY,METAL SQUARE,GOOD,NONE, ,28/08/2018 00:00,MONDAY,0,371
16342,BRADFORD ROAD, ,420068.22,434171.73,CALVERLEY & FARSLEY,METAL SQUARE,GOOD,NONE, ,28/08/2018 00:00,TUESDAY,0,379
16343,BRANCH END, ,425028.49,429043.97,MORLEY NORTH, , , , ,12/07/2011 00:00, ,0,381
16344,BRANCH ROAD, ,426267.54,431952.78,FARNLEY & WORTLEY, , , , ,12/07/2011 00:00, ,0,384
16345,BREARY LANE EAST, ,425600.95,443091.31,ADEL & WHARFEDALE,METAL SQUARE,GOOD,NONE, ,11/06/2018 00:00,TUE/THU,0,392
16347,BRIDGE ROAD, ,443079.08,445633.08,WETHERBY, , , , ,12/07/2011 00:00, ,0,395
16353,BRIGSHAW LANE, ,440778.27,429220.32,KIPPAX & METHLEY,METAL TWIN,FAIR,NONE, ,16/04/2019 00:00,SATURDAY,0,421
16354,BROAD LANE, ,424594.23,435638.4,BRAMLEY & STANNINGLEY,METAL SQUARE,GOOD,NONE, ,12/07/2018 00:00,MONDAY,0,427
16355,BROAD LANE, ,425051.93,435600.13,BRAMLEY & STANNINGLEY,METAL SQUARE,GOOD,NONE, ,12/07/2018 00:00,MONDAY,0,429
16356,BROAD LANE, ,424548.19,435642.01,BRAMLEY & STANNINGLEY,METAL SQUARE,GOOD,NONE, ,12/07/2018 00:00,MONDAY,0,436
16357,BROADWAY, ,424038.79,437707.3,HORSFORTH, , , , ,12/07/2011 00:00,TUE/THU/SAT,0,444
16358,BODMIN ROAD, ,429081.17,428245.56,MIDDLETON PARK,METAL SQUARE,GOOD,NONE, ,12/07/2018 00:00,TUESDAY,0,450
16359,BODMIN ROAD, ,428973.23,428505.27,MIDDLETON PARK,METAL SQUARE,GOOD,NONE, ,12/07/2018 00:00,TUESDAY,0,452
16360,BROWN LANE EAST, ,428742.16,432014.76,BEESTON & HOLBECK, , , , ,12/07/2011 00:00, ,0,454
16361,BROWN LANE EAST, ,428615.02,432017.47,BEESTON & HOLBECK, , , , ,12/07/2011 00:00, ,0,455
16362,BROWN LANE EAST, ,428675.38,432030.86,BEESTON & HOLBECK, , , , ,12/07/2011 00:00, ,0,457
16363,BROWNBERRIE LANE, ,424113.21,438988.45,HORSFORTH, , , , ,12/07/2011 00:00,DAILY,0,462
16364,BRUDENELL ROAD,JCT HESSLE VIEW,428409.28,435184.45,HEADINGLEY & HYDE PARK,METAL TWIN,POOR,NO LOCK, ,22/02/2019 00:00,DAILY,0,469
16365,BRUNTCLIFFE LANE, ,425120.26,427755.52,MORLEY SOUTH, , , , ,12/07/2011 00:00, ,0,473
16366,BRUNTCLIFFE LANE, ,425206.17,427797.99,MORLEY SOUTH, , , , ,12/07/2011 00:00, ,0,474
16367,BRUNTCLIFFE LANE, ,424789.06,427589.74,MORLEY SOUTH, , , , ,12/07/2011 00:00, ,0,475
16368,BURLEY ROAD,AT BUS STOP,428320.57,434423.22,LITTLE LONDON & WOODHOUSE,METAL TWIN,FAIR,NONE, ,28/06/2018 00:00,MONDAY,0,483
16369,BUTCHER HILL, ,426192.88,437540.58,KIRKSTALL,METAL SQUARE,GOOD,NONE, ,12/07/2018 00:00,DAILY,0,506
16370,BUTT LANE, ,425067.7,433292.49,FARNLEY & WORTLEY, , , , ,12/07/2011 00:00, ,0,509
16373,CANAL ROAD, ,422272.84,436439.16,CALVERLEY & FARSLEY,METAL TWIN,FAIR,NONE, ,28/08/2018 00:00,SATURDAY,0,529
16374,CANAL ROAD, ,427709.52,434059.51,ARMLEY,METAL SQUARE,GOOD,NONE, ,12/08/2018 00:00,MON/THU/SAT,0,530
16375,CANAL ROAD, ,422296.11,436399.77,CALVERLEY & FARSLEY,PLASTIC ROUND,FAIR,NONE, ,28/08/2018 00:00,SATURDAY,0,532
16376,CANAL ROAD, ,422264.05,436455.86,CALVERLEY & FARSLEY,PLASTIC ROUND,FAIR,NONE, ,28/08/2018 00:00,SATURDAY,0,534
16377,CARDIGAN ROAD,AT PELICAN CROSSING OPP ASHVILLE GROVE HEADINGLEY BOUND,428040.17,435037.81,HEADINGLEY & HYDE PARK,METAL TWIN,FAIR,NONE, ,25/06/2018 00:00,WEDNESDAY,0,540
16378,NEW FOREST WAY, ,430816.07,427533.45,MIDDLETON PARK,METAL SQUARE,GOOD,NONE, ,30/07/2018 00:00,SATURDAY,0,8247
16379,RINF ROAD MIDDLETON, ,430302.84,428109.46,MIDDLETON PARK,METAL SQUARE,GOOD,NONE, ,30/07/2018 00:00,DAILY,0,8249
16380,TOWN STREET, ,430670.22,428373.46,MIDDLETON PARK,METAL SQUARE,GOOD,NONE, ,30/07/2018 00:00,THURSDAY,0,8255
16381,MIDDLETON PARK ROAD, ,429937.85,427677.6,MIDDLETON PARK,METAL SQUARE,GOOD,NONE, ,30/07/2018 00:00,FRIDAY,0,8264
16382,MIDDLETON PARK CIRCUS, ,429914.89,428061.02,MIDDLETON PARK,METAL SQUARE,GOOD,NONE, ,30/07/2018 00:00,DAILY,0,8271
16383,BODMIN CRESCENT, ,429333.35,427977.95,MIDDLETON PARK,METAL SQUARE,GOOD,NONE, ,30/07/2018 00:00,TUESDAY,0,8272
16384,KIRKSTALL LANE,ON PATH,426304.46,435621.3,KIRKSTALL,METAL SQUARE,GOOD,NONE, ,13/08/2018 00:00,DAILY,0,8281
16385,NORTHCOTE CRESCENT,ON FOOTPATH,430040.25,431882.46,HUNSLET & RIVERSIDE,METAL SQUARE,GOOD,NONE, ,13/08/2018 00:00,TUESDAY,0,8918
16386,SWARCLIFFE DRIVE,OPP NO. 80,436175.37,435993.21,CROSSGATES & WHINMOOR,METAL SQUARE,GOOD,NONE, ,01/06/2019 00:00,MON/FRI,0,3151
16387,TEMPLENEWSAM ROAD, ,434803.14,433411.68,TEMPLE NEWSAM,METAL SQUARE,GOOD,NONE, ,01/06/2019 00:00,TUE/THU,0,3181
16388,ULLSWATER CRESCENT,O/S SHOPS,434208.85,433046.17,TEMPLE NEWSAM,METAL SQUARE,GOOD,NONE, ,01/06/2019 00:00,DAILY,0,3387
16389,WYKEBECK MOUNT, ,434033.69,433891.36,TEMPLE NEWSAM,METAL SQUARE,GOOD,NONE, ,01/06/2019 00:00,TUE/THU,0,3736
16392,BROAD LANE, ,424816.61,435616.84,BRAMLEY & STANNINGLEY,METAL SQUARE,GOOD,NONE, ,12/07/2018 00:00,TUESDAY,0,428
16393,BROAD LANE, ,423135.9,434919.97,BRAMLEY & STANNINGLEY,METAL SQUARE,GOOD,NONE, ,12/07/2018 00:00,TUE/THU,0,430
16394,BROADGATE WALK, ,424467.21,437973.66,HORSFORTH, , , , ,12/07/2011 00:00,TUE/THU/SAT,0,440
16395,BROADLEA HILL, ,425257.2,435745.39,BRAMLEY & STANNINGLEY,METAL SQUARE,GOOD,NONE, ,12/07/2018 00:00,MONDAY,0,441
16396,BROADLEA HILL, ,425247.42,435808.23,BRAMLEY & STANNINGLEY,METAL TWIN,GOOD,NONE, ,12/07/2018 00:00,MONDAY,0,442
16397,BROWN LANE EAST, ,428888.6,432017.39,BEESTON & HOLBECK, , , , ,12/07/2011 00:00, ,0,458
16398,BRUDENELL ROAD,O/S PARADE OF SHOPS,428508.71,435228.91,HEADINGLEY & HYDE PARK,METAL SQUARE,GOOD,NONE, ,22/02/2019 00:00,DAILY,0,467
16399,BRUNSWICK STREET, ,425999.53,428179.62,MORLEY SOUTH, , , , ,12/07/2011 00:00, ,0,472
16400,BURMANTOFTS STREET,JUCC WITH RIGTON APPROACH,431350.38,433810.1,BURMANTOFTS & RICHMOND HILL, , , , ,12/07/2011 00:00, ,0,494
16401,BURRAS LANE,ON BEND,420192.62,445335.47,OTLEY & YEADON,METAL TWIN,FAIR,NONE, ,11/06/2018 00:00,DAILY,0,499
16404,CARDIGAN ROAD, ,428102.41,434566.98,LITTLE LONDON & WOODHOUSE,METAL TWIN,FAIR,NONE, ,25/06/2018 00:00,MONDAY,0,537
16405,CARDIGAN ROAD, ,428108.59,434668.4,LITTLE LONDON & WOODHOUSE,METAL TWIN,FAIR,NONE, ,25/06/2018 00:00,DAILY,0,538
16406,CARDINAL SQUARE, ,428405.37,430104.89,BEESTON & HOLBECK, , , , ,12/07/2011 00:00, ,0,560
16407,CARR MANOR CRESCENT, ,429717.12,437811.5,MOORTOWN, , , , ,12/07/2018 00:00,THURSDAY,0,569
16408,CARRHOLM ROAD, ,429745.51,437071.66,MOORTOWN, , , , ,12/07/2018 00:00,THURSDAY,0,581
16409,CATTLE MARKET STREET, ,420267.39,445740.06,OTLEY & YEADON,METAL TWIN,POOR,NO LOCK, ,11/06/2018 00:00,DAILY,0,585
16410,CEMETERY ROAD,VIEWING POINT,421518.9,441869.81,OTLEY & YEADON,METAL TWIN,POOR,NO LOCK, ,11/06/2018 00:00,DAILY,0,589
16411,CEMETERY ROAD, ,421571.92,433568.32,CALVERLEY & FARSLEY, , , , ,28/08/2018 00:00,FRIDAY,0,591
16092,EASTGATE,VICTORIA GATE CASINO,430479.85,433698.54,LITTLE LONDON & WOODHOUSE,METAL SQUARE,GOOD,NONE,CITY CENTRE MANAGEMENT,22/09/2020 00:00,DAILY,0,323
16093,THE HEADROW,THREE LEGS PUB,430354.4,433716.31,LITTLE LONDON & WOODHOUSE,METAL SQUARE,GOOD,NONE,CITY CENTRE MANAGEMENT,22/09/2020 00:00,DAILY,0,195
16094,THE HEADROW,SPORTS DIRECT,430277,433754.41,LITTLE LONDON & WOODHOUSE,METAL SQUARE,GOOD,NONE,CITY CENTRE MANAGEMENT,22/09/2020 00:00,DAILY,0,325
16095,THE HEADROW,BARCLAYS,430391.4,433709.41,LITTLE LONDON & WOODHOUSE,METAL SQUARE,GOOD,NONE,CITY CENTRE MANAGEMENT,22/09/2020 00:00,DAILY,0,193
14578,IVESON APPROACH, ,425858.72,438728.4,WEETWOOD, , , , ,12/07/2011 00:00,MON/WED/FRI,0,1549
14579,IVESON DRIVE, ,425823.51,438663.62,WEETWOOD, , , , ,12/07/2011 00:00,MON/WED/FRI,0,1555
14580,IVESON DRIVE, ,425840.41,438646.72,WEETWOOD, , , , ,12/07/2011 00:00,MON/WED/FRI,0,1556
14581,IVESON DRIVE, ,425865.76,438628.41,WEETWOOD, , , , ,12/07/2011 00:00,MON/WED/FRI,0,1557
14582,IVESON DRIVE, ,425938.99,438597.43,WEETWOOD, , , , ,12/07/2011 00:00,MON/WED/FRI,0,1559
14583,IVESON RISE, ,426175.23,438642.49,WEETWOOD, , , , ,12/07/2011 00:00,MON/WED/FRI,0,1563
14584,KENT ROAD, ,422830.51,433435.67,PUDSEY,PLASTIC ROUND,FAIR,NONE, ,28/08/2018 00:00,WEDNESDAY,0,1569
14585,KENT ROAD, ,422992.74,432700.49,PUDSEY, , , , ,28/08/2018 00:00,DAILY,0,1570
14586,KENT ROAD, ,422947.76,433107.95,PUDSEY, , , , ,28/08/2018 00:00,WEDNESDAY,0,1571
14587,KENTMERE AVENUE, ,434976.14,436633.2,KILLINGBECK & SEACROFT, , , , ,12/07/2011 00:00, ,0,1573
14588,KING LANE, ,430043.51,438466.72,MOORTOWN, , , , ,12/07/2018 00:00,WEDNESDAY,0,1589
14589,KING LANE, ,428984.66,439921.27,ALWOODLEY, , , , ,12/07/2011 00:00, ,0,1592
14590,KING LANE, ,429180.61,439770.01,ALWOODLEY, , , , ,12/07/2011 00:00, ,0,1593
14591,KING LANE, ,429382.98,439541.5,ALWOODLEY, , , , ,12/07/2011 00:00, ,0,1608
14592,KING LANE,KING LANE CAR PARK,429542.73,439339.58,ALWOODLEY, , , , ,12/07/2011 00:00, ,0,1611
14593,KING STREET, ,422553.63,428857.68,MORLEY NORTH, , , , ,12/07/2011 00:00, ,0,1616
14594,KING STREET, ,422457.26,428943.6,MORLEY NORTH, , , , ,12/07/2011 00:00, ,0,1619
14595,KINGS APPROACH, ,425300.06,434502.09,ARMLEY,METAL SQUARE,GOOD,NONE, ,12/08/2018 00:00,MON/THU/SAT,0,1622
14596,KIRK LANE,O/S PO,420270.97,441132.68,GUISELEY & RAWDON,METAL TWIN,FAIR,NONE, ,12/07/2018 00:00,MON/THU/SUN,0,1626
14597,KIRK MILLS, ,438327.72,440535.2,HAREWOOD, , , , ,12/07/2011 00:00, ,0,1629
14603,KIRKSTALL HILL, ,426825.6,435466.82,KIRKSTALL,METAL SQUARE,GOOD,NONE, ,12/07/2018 00:00,WED/SUN,0,1657
14604,KIRKSTALL LANE, ,426371.12,435595.62,KIRKSTALL,METAL TWIN,POOR,NO LOCK, ,12/07/2018 00:00,DAILY,0,1658
14605,KIRKSTALL ROAD, ,426597.09,435127.05,KIRKSTALL,METAL SQUARE,GOOD,NONE, ,12/07/2018 00:00,WED/SUN,0,1667
14606,KIRKSTALL ROAD, ,427067.92,434843.87,KIRKSTALL,METAL SQUARE,GOOD,NONE, ,12/07/2018 00:00,DAILY,0,1673
14607,KNOWSTHORPE GATE, ,432815.76,432011.91,BURMANTOFTS & RICHMOND HILL, , , , ,12/07/2011 00:00, ,0,1691
14609,LANE END, ,422794.3,433584.2,PUDSEY, , , , ,28/08/2018 00:00,WEDNESDAY,0,1699
14610,LAWNS LANE, ,424904.7,431840.96,FARNLEY & WORTLEY, , , , ,12/07/2011 00:00, ,0,1708
14611,LEADWELL LANE, ,432655.67,427423.68,ARDSLEY & ROBIN HOOD, , , , ,12/07/2011 00:00, ,0,1713
14612,LEADWELL LANE, ,432779.95,427535.29,ARDSLEY & ROBIN HOOD, , , , ,12/07/2011 00:00, ,0,1714
14613,CLARENDON ROAD, ,429194.31,434871.45,LITTLE LONDON & WOODHOUSE, , , , ,12/07/2018 00:00,MONDAY,0,710
14614,CLAYPIT LANE, ,445569.15,429756.2,KIPPAX & METHLEY,METAL SQUARE,GOOD,NONE, ,16/04/2019 00:00,THURSDAY,0,712