OBJECTID,ROAD_NAME,LOCATION,LOCATIONGROUP,EASTING,NORTHING,WARD,MODEL,APERTURE,FIXINGS,LINER,SIGNAGE,MAINCOLOUR,CONDITION,DEFECTS,ROUTE,COMMENTS,LASTUPDATED,FREQUENCY,SEQUENCE,MON,TUE,WED,THU,FRI,SAT,SUN
1,A58,SLIPROAD BUS STOP,BUS STOP OR SHELTER,429135.64,433579.33,LITTLE LONDON & WOODHOUSE,METAL SQUARE,POSTBOX 4 SIDES WITH SELF CLOSING ASHTRAY,500MM X 500MM BALLAST ONLY,120 LITRES,LCC LOGO DOG WASTE ACCEPTED,JET BLACK - RAL 9005,GOOD,NONE,CITY CENTRE MANAGEMENT,,22/09/2020 00:00,DAILY,0,,,,,,,
2,A58,SLIPROAD BUS STOP,BUS STOP OR SHELTER,429158.48,433598.08,LITTLE LONDON & WOODHOUSE,METAL SQUARE,POSTBOX 4 SIDES WITH SELF CLOSING ASHTRAY,500MM X 500MM BALLAST ONLY,120 LITRES,LCC LOGO DOG WASTE ACCEPTED,JET BLACK - RAL 9005,GOOD,NONE,CITY CENTRE MANAGEMENT,,22/09/2020 00:00,DAILY,0,,,,,,,
4,A650,IN LAYBY,GENERAL PATH - HIGH FOOT FALL,421219.5821,429046.4841,MORLEY NORTH,METAL SQUARE,POSTBOX 4 SIDES WITH SELF CLOSING ASHTRAY,500MM X 500MM BALLAST ONLY,120 LITRES,LCC LOGO DOG WASTE ACCEPTED,JET BLACK - RAL 9005,POOR,RUST & DOOR BROKEN,,,12/07/2011 00:00,MON,0,,,,,,,
6,ABBEY ROAD,AT BUS STOP,BUS STOP OR SHELTER,425188.59,436538.37,KIRKSTALL,PLASTIC ROUND,OPEN TOP,GROUND BOLTS,80 LITRES,LCC LOGO,BLACK,POOR,NO LINER,,,03/05/2018 00:00,MON/FRI,0,,,,,,,
7,ABBEY ROAD,CORNER OF ABBEY WALK,GENERAL PATH - HIGH FOOT FALL,425933.23,436267.67,KIRKSTALL,METAL TWIN,POSTBOX FRONT AND BACK,GROUND BOLTS,TWIN LINERS,LCC LOGO,GREY,FAIR,NONE,,,12/07/2018 00:00,DAILY,0,,,,,,,
8,ABBEY ROAD,CORNER OF VESPER WALK,GENERAL PATH - HIGH FOOT FALL,425417.65,436436.34,KIRKSTALL,METAL SQUARE,POSTBOX 4 SIDES WITH SELF CLOSING ASHTRAY,500MM X 500MM BALLAST ONLY,120 LITRES,LCC LOGO DOG WASTE ACCEPTED,JET BLACK - RAL 9005,GOOD,NONE,,,12/05/2018 00:00,MON/FRI,0,,,,,,,
9,ABBEY ROAD,IN FRONT OF MEMORIAL,MONUMENT/BENCH/POW/CAR PARK,426269.49,435634.51,KIRKSTALL,METAL SQUARE,POSTBOX 4 SIDES WITH SELF CLOSING ASHTRAY,500MM X 500MM BALLAST ONLY,120 LITRES,LCC LOGO DOG WASTE ACCEPTED,JET BLACK - RAL 9005,GOOD,NONE,,,12/07/2018 00:00,DAILY,0,,,,,,,
10,ABERFORD ROAD,,GENERAL PATH - HIGH FOOT FALL,436616.75,428630.71,ROTHWELL,METAL SQUARE,POSTBOX 4 SIDES WITH SELF CLOSING ASHTRAY,500MM X 500MM BALLAST ONLY,120 LITRES,LCC LOGO DOG WASTE ACCEPTED,JET BLACK - RAL 9005,GOOD,NONE,,,22/09/2020 00:00,DAILY,0,,,,,,,
11,ABERFORD ROAD,,GENERAL PATH - HIGH FOOT FALL,436861.31,428960.35,ROTHWELL,METAL SQUARE,POSTBOX 4 SIDES WITH SELF CLOSING ASHTRAY,500MM X 500MM BALLAST ONLY,120 LITRES,LCC LOGO DOG WASTE ACCEPTED,JET BLACK - RAL 9005,GOOD,NONE,,,22/09/2020 00:00,DAILY,0,,,,,,,
12,ABERFORD ROAD,,GENERAL PATH - HIGH FOOT FALL,436833.6,428982.02,ROTHWELL,METAL SQUARE,POSTBOX 4 SIDES WITH SELF CLOSING ASHTRAY,500MM X 500MM BALLAST ONLY,120 LITRES,LCC LOGO DOG WASTE ACCEPTED,JET BLACK - RAL 9005,GOOD,NONE,,,22/09/2020 00:00,DAILY,0,,,,,,,
13,ABERFORD ROAD,,GENERAL PATH - HIGH FOOT FALL,436588.53,428602.83,ROTHWELL,METAL SQUARE,POSTBOX 4 SIDES WITH SELF CLOSING ASHTRAY,500MM X 500MM BALLAST ONLY,120 LITRES,LCC LOGO DOG WASTE ACCEPTED,JET BLACK - RAL 9005,GOOD,NONE,,,22/09/2020 00:00,DAILY,0,,,,,,,
14,ABERFORD ROAD,,GENERAL PATH - HIGH FOOT FALL,436665.35,428683.35,ROTHWELL,METAL SQUARE,POSTBOX 4 SIDES WITH SELF CLOSING ASHTRAY,500MM X 500MM BALLAST ONLY,120 LITRES,LCC LOGO DOG WASTE ACCEPTED,JET BLACK - RAL 9005,GOOD,NONE,,,22/09/2020 00:00,DAILY,0,,,,,,,
15,ABERFORD ROAD,,GENERAL PATH - HIGH FOOT FALL,436979.76,428883.69,ROTHWELL,METAL SQUARE,POSTBOX 4 SIDES WITH SELF CLOSING ASHTRAY,500MM X 500MM BALLAST ONLY,120 LITRES,LCC LOGO DOG WASTE ACCEPTED,JET BLACK - RAL 9005,GOOD,NONE,,,22/09/2020 00:00,DAILY,0,,,,,,,
16,ABERFORD ROAD,,GENERAL PATH - HIGH FOOT FALL,436909.38,429046.73,ROTHWELL,METAL SQUARE,POSTBOX 4 SIDES WITH SELF CLOSING ASHTRAY,500MM X 500MM BALLAST ONLY,120 LITRES,LCC LOGO DOG WASTE ACCEPTED,JET BLACK - RAL 9005,GOOD,NONE,,,22/09/2020 00:00,DAILY,0,,,,,,,
17,ABERFORD ROAD,,GENERAL PATH - HIGH FOOT FALL,436756.76,428842.54,ROTHWELL,METAL SQUARE,POSTBOX 4 SIDES WITH SELF CLOSING ASHTRAY,500MM X 500MM BALLAST ONLY,120 LITRES,LCC LOGO DOG WASTE ACCEPTED,JET BLACK - RAL 9005,GOOD,NONE,,,22/09/2020 00:00,DAILY,0,,,,,,,
18,ABERFORD ROAD,,GENERAL PATH - HIGH FOOT FALL,436317.25,428331.78,ROTHWELL,METAL SQUARE,POSTBOX 4 SIDES WITH SELF CLOSING ASHTRAY,500MM X 500MM BALLAST ONLY,120 LITRES,LCC LOGO DOG WASTE ACCEPTED,JET BLACK - RAL 9005,GOOD,NONE,,,22/09/2020 00:00,DAILY,0,,,,,,,
19,ABERFORD ROAD,,GENERAL PATH - HIGH FOOT FALL,441679.16,433841.27,GARFORTH & SWILLINGTON,METAL SQUARE,POSTBOX 4 SIDES WITH SELF CLOSING ASHTRAY,500MM X 500MM BALLAST ONLY,120 LITRES,LCC LOGO DOG WASTE ACCEPTED,JET BLACK - RAL 9005,GOOD,NONE,,,16/04/2019 00:00,WED,0,,,,,,,
20,ABERFORD ROAD,,GENERAL PATH - HIGH FOOT FALL,441286.5441,433592.3028,GARFORTH & SWILLINGTON,METAL SQUARE,POSTBOX 4 SIDES WITH SELF CLOSING ASHTRAY,500MM X 500MM BALLAST ONLY,120 LITRES,LCC LOGO DOG WASTE ACCEPTED,JET BLACK - RAL 9005,GOOD,NONE,,,16/04/2019 00:00,DAILY,0,,,,,,,
21,ABERFORD ROAD,WAR MEMORIAL,MONUMENT/BENCH/POW/CAR PARK,436425.05,428399.21,ROTHWELL,METAL SQUARE,POSTBOX 4 SIDES WITH SELF CLOSING ASHTRAY,500MM X 500MM BALLAST ONLY,120 LITRES,LCC LOGO DOG WASTE ACCEPTED,JET BLACK - RAL 9005,GOOD,NONE,,,22/09/2020 00:00,DAILY,0,,,,,,,
22,ABRAHAM HILL,,GENERAL PATH - HIGH FOOT FALL,434581.35,428577.96,ROTHWELL,METAL SQUARE,POSTBOX 4 SIDES WITH SELF CLOSING ASHTRAY,500MM X 500MM BALLAST ONLY,120 LITRES,LCC LOGO DOG WASTE ACCEPTED,JET BLACK - RAL 9005,GOOD,NONE,,,22/09/2020 00:00,DAILY,0,,,,,,,
23,ACKROYD STREET,,GENERAL PATH - HIGH FOOT FALL,426670.0735,427820.7521,MORLEY SOUTH,METAL SQUARE,POSTBOX 4 SIDES WITH SELF CLOSING ASHTRAY,500MM X 500MM BALLAST ONLY,120 LITRES,LCC LOGO DOG WASTE ACCEPTED,JET BLACK - RAL 9005,GOOD,NONE,,,12/05/2018 00:00,DAILY,0,,,,,,,
24,ACRE ROAD,AT ENTRANCE TO HIGHWAYS OFFICES,SHOPS/OFFICES,430574.5,427839.78,MIDDLETON PARK,METAL SQUARE,POSTBOX 4 SIDES WITH SELF CLOSING ASHTRAY,500MM X 500MM BALLAST ONLY,120 LITRES,LCC LOGO DOG WASTE ACCEPTED,JET BLACK - RAL 9005,GOOD,NONE,,,12/05/2018 00:00,FRI,0,,,,,,,
25,ACRE ROAD,,GENERAL PATH - HIGH FOOT FALL,429718.46,427567.91,MIDDLETON PARK,METAL SQUARE,POSTBOX 4 SIDES WITH SELF CLOSING ASHTRAY,500MM X 500MM BALLAST ONLY,120 LITRES,LCC LOGO DOG WASTE ACCEPTED,JET BLACK - RAL 9005,GOOD,NONE,,,30/07/2018 00:00,TUE,0,,,,,,,
26,ADEL LANE,,GENERAL PATH - HIGH FOOT FALL,427067.91,439613.11,ADEL & WHARFEDALE,METAL SQUARE,POSTBOX 4 SIDES WITH SELF CLOSING ASHTRAY,500MM X 500MM BALLAST ONLY,120 LITRES,LCC LOGO DOG WASTE ACCEPTED,JET BLACK - RAL 9005,GOOD,NONE,,,19/10/2020 00:00,MON/WED/SAT,0,,,,,,,
27,AINSTY ROAD,O/S CO-OP,SHOPS/OFFICES,440042.4824,449280.7694,WETHERBY,PLASTIC ROUND,OPEN TOP,GROUND BOLTS,80 LITRES,LCC LOGO,BLACK,POOR,NO LINER,,,17/10/2020 00:00,MON,0,,,,,,,
28,AINSTY ROAD,,SHOPS/OFFICES,440063.6002,449278.4891,WETHERBY,PLASTIC ROUND,OPEN TOP,GROUND BOLTS,80 LITRES,LCC LOGO,BLACK,POOR,NO LINER,,,17/10/2020 00:00,MON,0,,,,,,,
29,AINSTY ROAD,ON PATH,GENERAL PATH - HIGH FOOT FALL,439747.0685,449331.7796,WETHERBY,METAL SQUARE,POSTBOX 4 SIDES WITH SELF CLOSING ASHTRAY,500MM X 500MM BALLAST ONLY,120 LITRES,LCC LOGO DOG WASTE ACCEPTED,JET BLACK - RAL 9005,FAIR,NONE,,,17/10/2020 00:00,MON,0,,,,,,,
30,AIRE STREET,BUS STOP,BUS STOP OR SHELTER,429689.12,433364.04,HUNSLET & RIVERSIDE,METAL SQUARE,POSTBOX 4 SIDES WITH SELF CLOSING ASHTRAY,500MM X 500MM BALLAST ONLY,120 LITRES,LCC LOGO DOG WASTE ACCEPTED,JET BLACK - RAL 9005,GOOD,NONE,CITY CENTRE MANAGEMENT,,22/09/2020 00:00,DAILY,0,,,,,,,
31,AIRE STREET,PRINCES EXCHANGE STEPS,SHOPS/OFFICES,429753.16,433355.41,HUNSLET & RIVERSIDE,METAL SQUARE,POSTBOX 4 SIDES WITH SELF CLOSING ASHTRAY,500MM X 500MM BALLAST ONLY,120 LITRES,LCC LOGO DOG WASTE ACCEPTED,JET BLACK - RAL 9005,GOOD,NONE,CITY CENTRE MANAGEMENT,,22/09/2020 00:00,DAILY,0,,,,,,,
32,AIRE STREET,PRINCES EXCHANGE STEPS,SHOPS/OFFICES,429744.79,433355.55,HUNSLET & RIVERSIDE,METAL SQUARE,POSTBOX 4 SIDES WITH SELF CLOSING ASHTRAY,500MM X 500MM BALLAST ONLY,120 LITRES,LCC LOGO DOG WASTE ACCEPTED,JET BLACK - RAL 9005,GOOD,NONE,CITY CENTRE MANAGEMENT,,22/09/2020 00:00,DAILY,0,,,,,,,
33,ALANDALE CRESCENT,,GENERAL PATH - HIGH FOOT FALL,439652.29,432883.5,GARFORTH & SWILLINGTON,PLASTIC ROUND,OPEN TOP,GROUND BOLTS,80 LITRES,LCC LOGO,BLACK,POOR,NONE,,,16/04/2019 00:00,WED,0,,,,,,,
34,ALANDALE CRESCENT,,GENERAL PATH - HIGH FOOT FALL,439552.26,432945.94,GARFORTH & SWILLINGTON,PLASTIC ROUND,OPEN TOP,GROUND BOLTS,80 LITRES,LCC LOGO,BLACK,POOR,NONE,,,16/04/2019 00:00,WED,0,,,,,,,
35,ALBERT DRIVE,,SHOPS/OFFICES,427654.2468,428099.3651,MORLEY SOUTH,METAL SQUARE,POSTBOX 4 SIDES WITH SELF CLOSING ASHTRAY,500MM X 500MM BALLAST ONLY,120 LITRES,LCC LOGO DOG WASTE ACCEPTED,JET BLACK - RAL 9005,GOOD,NONE,,,12/07/2011 00:00,MON,0,,,,,,,
36,ALBERT DRIVE,,SHOPS/OFFICES,427639.2838,428096.21,MORLEY SOUTH,METAL TWIN,POSTBOX FRONT AND BACK,GROUND BOLTS,TWIN LINERS,NONE,GREY,FAIR,NONE,,,12/07/2011 00:00,MON,0,,,,,,,
37,ALBERT ROAD,OPP TROY ROAD,GENERAL PATH - HIGH FOOT FALL,426687.72,428136.89,MORLEY SOUTH,METAL SQUARE,POSTBOX 4 SIDES WITH SELF CLOSING ASHTRAY,500MM X 500MM BALLAST ONLY,120 LITRES,LCC LOGO DOG WASTE ACCEPTED,JET BLACK - RAL 9005,GOOD,NONE,,,12/05/2018 00:00,MON,0,,,,,,,
38,ALBION PLACE,BODY SHOP,SHOPS/OFFICES,430234.25,433596.87,LITTLE LONDON & WOODHOUSE,METAL SQUARE,POSTBOX 4 SIDES WITH SELF CLOSING ASHTRAY,500MM X 500MM BALLAST ONLY,120 LITRES,LCC LOGO DOG WASTE ACCEPTED,JET BLACK - RAL 9005,GOOD,NONE,CITY CENTRE MANAGEMENT,,22/09/2020 00:00,DAILY,0,,,,,,,
39,ALBION PLACE,OPP LOST AND FOUND,SHOPS/OFFICES,430103.65,433592.01,LITTLE LONDON & WOODHOUSE,METAL SQUARE,POSTBOX 4 SIDES WITH SELF CLOSING ASHTRAY,500MM X 500MM BALLAST ONLY,120 LITRES,LCC LOGO DOG WASTE ACCEPTED,JET BLACK - RAL 9005,GOOD,NONE,CITY CENTRE MANAGEMENT,,22/09/2020 00:00,DAILY,0,,,,,,,
40,ALBION PLACE,RUNNER NEEDS,SHOPS/OFFICES,430206.15,433598.3,LITTLE LONDON & WOODHOUSE,METAL SQUARE,POSTBOX 4 SIDES WITH SELF CLOSING ASHTRAY,500MM X 500MM BALLAST ONLY,120 LITRES,LCC LOGO DOG WASTE ACCEPTED,JET BLACK - RAL 9005,GOOD,NONE,CITY CENTRE MANAGEMENT,,22/09/2020 00:00,DAILY,0,,,,,,,
41,ALBION PLACE,SNOW ROCK,SHOPS/OFFICES,430181.41,433599.99,LITTLE LONDON & WOODHOUSE,METAL SQUARE,POSTBOX 4 SIDES WITH SELF CLOSING ASHTRAY,500MM X 500MM BALLAST ONLY,120 LITRES,LCC LOGO DOG WASTE ACCEPTED,JET BLACK - RAL 9005,GOOD,NONE,CITY CENTRE MANAGEMENT,,22/09/2020 00:00,DAILY,0,,,,,,,
42,ALBION PLACE,WH SMITHS,SHOPS/OFFICES,430140.89,433590.96,LITTLE LONDON & WOODHOUSE,METAL SQUARE,POSTBOX 4 SIDES WITH SELF CLOSING ASHTRAY,500MM X 500MM BALLAST ONLY,120 LITRES,LCC LOGO DOG WASTE ACCEPTED,JET BLACK - RAL 9005,GOOD,NONE,CITY CENTRE MANAGEMENT,,22/09/2020 00:00,DAILY,0,,,,,,,
43,ALBION PLACE,WH SMITHS,SHOPS/OFFICES,430155.98,433589.09,LITTLE LONDON & WOODHOUSE,METAL SQUARE,POSTBOX 4 SIDES WITH SELF CLOSING ASHTRAY,500MM X 500MM BALLAST ONLY,120 LITRES,LCC LOGO DOG WASTE ACCEPTED,JET BLACK - RAL 9005,GOOD,NONE,CITY CENTRE MANAGEMENT,,22/09/2020 00:00,DAILY,0,,,,,,,
44,ALBION STREET,CAR PARK ENT,GENERAL PATH - HIGH FOOT FALL,426498.02,427826.61,MORLEY SOUTH,METAL SQUARE,POSTBOX 4 SIDES WITH SELF CLOSING ASHTRAY,500MM X 500MM BALLAST ONLY,120 LITRES,LCC LOGO DOG WASTE ACCEPTED,JET BLACK - RAL 9005,GOOD,NONE,,,12/05/2018 00:00,DAILY,0,,,,,,,
45,ALBION STREET,CITY EXCHANGE,SHOPS/OFFICES,430050.6,433475.3,LITTLE LONDON & WOODHOUSE,METAL SQUARE,POSTBOX 4 SIDES WITH SELF CLOSING ASHTRAY,500MM X 500MM BALLAST ONLY,120 LITRES,LCC LOGO DOG WASTE ACCEPTED,JET BLACK - RAL 9005,GOOD,NONE,CITY CENTRE MANAGEMENT,,22/09/2020 00:00,DAILY,0,,,,,,,
46,ALBION STREET,COSY CLUB,SHOPS/OFFICES,430052.46,433583.78,LITTLE LONDON & WOODHOUSE,METAL SQUARE,POSTBOX 4 SIDES WITH SELF CLOSING ASHTRAY,500MM X 500MM BALLAST ONLY,120 LITRES,LCC LOGO DOG WASTE ACCEPTED,JET BLACK - RAL 9005,GOOD,NONE,CITY CENTRE MANAGEMENT,,22/09/2020 00:00,DAILY,0,,,,,,,
47,ALBION STREET,ASICS,SHOPS/OFFICES,430062.34,433515.6,LITTLE LONDON & WOODHOUSE,METAL SQUARE,POSTBOX 4 SIDES WITH SELF CLOSING ASHTRAY,500MM X 500MM BALLAST ONLY,120 LITRES,LCC LOGO DOG WASTE ACCEPTED,JET BLACK - RAL 9005,GOOD,NONE,CITY CENTRE MANAGEMENT,,22/09/2020 00:00,DAILY,0,,,,,,,
48,ALBION STREET,BARCLAYS,SHOPS/OFFICES,430053.39,433622.39,LITTLE LONDON & WOODHOUSE,METAL SQUARE,POSTBOX 4 SIDES WITH SELF CLOSING ASHTRAY,500MM X 500MM BALLAST ONLY,120 LITRES,LCC LOGO DOG WASTE ACCEPTED,JET BLACK - RAL 9005,GOOD,NONE,CITY CENTRE MANAGEMENT,,22/09/2020 00:00,DAILY,0,,,,,,,
49,ALBION STREET,BOOTS,SHOPS/OFFICES,430052.86,433681.58,LITTLE LONDON & WOODHOUSE,METAL SQUARE,POSTBOX 4 SIDES WITH SELF CLOSING ASHTRAY,500MM X 500MM BALLAST ONLY,120 LITRES,LCC LOGO DOG WASTE ACCEPTED,JET BLACK - RAL 9005,GOOD,NONE,CITY CENTRE MANAGEMENT,,22/09/2020 00:00,DAILY,0,,,,,,,
50,ALBION STREET,GREGGS,TAKEAWAY,430060.8,433830.54,LITTLE LONDON & WOODHOUSE,METAL SQUARE,POSTBOX 4 SIDES WITH SELF CLOSING ASHTRAY,500MM X 500MM BALLAST ONLY,120 LITRES,LCC LOGO DOG WASTE ACCEPTED,JET BLACK - RAL 9005,GOOD,NONE,CITY CENTRE MANAGEMENT,,22/09/2020 00:00,DAILY,0,,,,,,,
51,ALBION STREET,LOVE AROMA,TAKEAWAY,430050.78,433506.81,LITTLE LONDON & WOODHOUSE,METAL SQUARE,POSTBOX 4 SIDES WITH SELF CLOSING ASHTRAY,500MM X 500MM BALLAST ONLY,120 LITRES,LCC LOGO DOG WASTE ACCEPTED,JET BLACK - RAL 9005,GOOD,NONE,CITY CENTRE MANAGEMENT,,22/09/2020 00:00,DAILY,0,,,,,,,
52,ALBION STREET,MCDONALDS,TAKEAWAY,430094.6,433910.68,LITTLE LONDON & WOODHOUSE,RECYCLING YELLOW,SINGLE ROUND POSTBOX OPENING IN FRONT,500MM X 500MM BALLAST ONLY,120 LITRES,EMPTY PLASTIC AND CANS - NOWT ELSE WITH RED/GREY PLASTIC BOTTLES LOGO,YELLOW- RAL 1023,GOOD,NONE,CITY CENTRE MANAGEMENT,,22/09/2020 00:00,DAILY,0,,,,,,,
53,ALBION STREET,MCDONALDS,TAKEAWAY,430091.09,433894.9,LITTLE LONDON & WOODHOUSE,COMPACTING SOLAR,POSTBOX FRONT PULLDOWN LOADING TRAY,500MM X 500MM BALLAST ONLY,120 LITRES,LCC LOGO GENERAL WASTE,BLACK,GOOD,NONE,CITY CENTRE MANAGEMENT,,22/09/2020 00:00,DAILY,0,,,,,,,
54,ALBION STREET,MOD PIZZA,TAKEAWAY,430051.72,433572.32,LITTLE LONDON & WOODHOUSE,COMPACTING SOLAR,POSTBOX FRONT PULLDOWN LOADING TRAY,500MM X 500MM BALLAST ONLY,120 LITRES,LCC LOGO GENERAL WASTE,BLACK,GOOD,NONE,CITY CENTRE MANAGEMENT,,22/09/2020 00:00,DAILY,0,,,,,,,
55,ALBION STREET,MOD PIZZA,TAKEAWAY,430052.58,433563.75,LITTLE LONDON & WOODHOUSE,RECYCLING YELLOW,SINGLE ROUND POSTBOX OPENING IN FRONT,500MM X 500MM BALLAST ONLY,120 LITRES,EMPTY PLASTIC AND CANS - NOWT ELSE WITH RED/GREY PLASTIC BOTTLES LOGO,YELLOW- RAL 1023,GOOD,NONE,CITY CENTRE MANAGEMENT,,22/09/2020 00:00,DAILY,0,,,,,,,
56,ALBION STREET,,GENERAL PATH - HIGH FOOT FALL,420732.88,445218.86,OTLEY & YEADON,PLASTIC POST,POSTBOX FRONT,METAL STRAP,80 LITRES,LCC LOGO,YELLOW- RAL 1023,POOR,NONE,,,11/06/2018 00:00,MON,0,,,,,,,
57,ALBION STREET,,GENERAL PATH - HIGH FOOT FALL,420695.31,445213.02,OTLEY & YEADON,PLASTIC POST,POSTBOX FRONT,METAL STRAP,80 LITRES,LCC LOGO,YELLOW- RAL 1023,POOR,NONE,,,11/06/2018 00:00,MON,0,,,,,,,
58,ALBION STREET,PLAYERS,PUB,430064.59,433893.63,LITTLE LONDON & WOODHOUSE,METAL SQUARE,POSTBOX 4 SIDES WITH SELF CLOSING ASHTRAY,500MM X 500MM BALLAST ONLY,120 LITRES,LCC LOGO DOG WASTE ACCEPTED,JET BLACK - RAL 9005,GOOD,NONE,CITY CENTRE MANAGEMENT,,22/09/2020 00:00,DAILY,0,,,,,,,
59,ALBION STREET,THE CUBE,PUB,430063.33,433874.71,LITTLE LONDON & WOODHOUSE,METAL SQUARE,POSTBOX 4 SIDES WITH SELF CLOSING ASHTRAY,500MM X 500MM BALLAST ONLY,120 LITRES,LCC LOGO DOG WASTE ACCEPTED,JET BLACK - RAL 9005,GOOD,NONE,CITY CENTRE MANAGEMENT,,22/09/2020 00:00,DAILY,0,,,,,,,
60,ALBION STREET,TIMPSONS,SHOPS/OFFICES,430065.85,433435.59,LITTLE LONDON & WOODHOUSE,METAL SQUARE,POSTBOX 4 SIDES WITH SELF CLOSING ASHTRAY,500MM X 500MM BALLAST ONLY,120 LITRES,LCC LOGO DOG WASTE ACCEPTED,JET BLACK - RAL 9005,GOOD,NONE,CITY CENTRE MANAGEMENT,,22/09/2020 00:00,DAILY,0,,,,,,,
61,ALBION STREET,TURTLE BAY,SHOPS/OFFICES,430059.67,433817.51,LITTLE LONDON & WOODHOUSE,METAL SQUARE,POSTBOX 4 SIDES WITH SELF CLOSING ASHTRAY,500MM X 500MM BALLAST ONLY,120 LITRES,LCC LOGO DOG WASTE ACCEPTED,JET BLACK - RAL 9005,GOOD,NONE,CITY CENTRE MANAGEMENT,,22/09/2020 00:00,DAILY,0,,,,,,,
62,ALBION STREET,WATERSTONES,SHOPS/OFFICES,430055.47,433733.57,LITTLE LONDON & WOODHOUSE,METAL SQUARE,POSTBOX 4 SIDES WITH SELF CLOSING ASHTRAY,500MM X 500MM BALLAST ONLY,120 LITRES,LCC LOGO DOG WASTE ACCEPTED,JET BLACK - RAL 9005,GOOD,NONE,CITY CENTRE MANAGEMENT,,22/09/2020 00:00,DAILY,0,,,,,,,
63,ALDERSYDE ROAD,ENT TO PATH,GENERAL PATH - HIGH FOOT FALL,418628.1353,441911.0392,GUISELEY & RAWDON,METAL TWIN,POSTBOX FRONT AND BACK,GROUND BOLTS,TWIN LINERS,LCC LOGO,GREY,FAIR,NONE,,,18/04/2023 00:00,THU/SUN,0,,,,,,,
65,ALEXANDRA ROAD,,GENERAL PATH - HIGH FOOT FALL,428479.2158,434565.8717,LITTLE LONDON & WOODHOUSE,METAL TWIN,POSTBOX FRONT AND BACK,GROUND BOLTS,TWIN LINERS,LCC LOGO,GREY,POOR,NO LOCK,HHH,,25/06/2018 00:00,WED,0,,,,,,,
69,ALWOODLEY LANE,BENCH NR BUS STOP O/S NO 184A,BUS STOP OR SHELTER,429871.543,440779.9898,ALWOODLEY,METAL SQUARE,POSTBOX 4 SIDES WITH SELF CLOSING ASHTRAY,500MM X 500MM BALLAST ONLY,120 LITRES,LCC LOGO DOG WASTE ACCEPTED,JET BLACK - RAL 9005,GOOD,NONE,,,17/09/2021 00:00,MON,0,,,,,,,
70,ARMOURIES WAY,CNR OF BLACK BULL ST,GENERAL PATH - HIGH FOOT FALL,430729.85,433038.18,HUNSLET & RIVERSIDE,METAL SQUARE,POSTBOX 4 SIDES WITH SELF CLOSING ASHTRAY,500MM X 500MM BALLAST ONLY,120 LITRES,LCC LOGO DOG WASTE ACCEPTED,JET BLACK - RAL 9005,FAIR,FADED PAINTWORK,CITY CENTRE MANAGEMENT,,22/09/2020 00:00,DAILY,0,,,,,,,
71,ALWOODLEY LANE,OPP THE QUARY,GENERAL PATH - HIGH FOOT FALL,429249.2,440815.5,ALWOODLEY,METAL SQUARE,POSTBOX 4 SIDES WITH SELF CLOSING ASHTRAY,500MM X 500MM BALLAST ONLY,120 LITRES,LCC LOGO DOG WASTE ACCEPTED,JET BLACK - RAL 9005,GOOD,NONE,,,17/09/2021 00:00,MON,0,,,,,,,
72,ALWOODLEY LANE,PATH NEXT TO NO 278,GENERAL PATH - HIGH FOOT FALL,430367.2267,440709.425,ALWOODLEY,METAL SQUARE,POSTBOX 4 SIDES WITH SELF CLOSING ASHTRAY,500MM X 500MM BALLAST ONLY,120 LITRES,LCC LOGO DOG WASTE ACCEPTED,JET BLACK - RAL 9005,GOOD,NONE,,,17/09/2021 00:00,MON,0,,,,,,,
73,ALWWODLEY LANE,ENT ECCUP RESERVOIR,MONUMENT/BENCH/POW/CAR PARK,429675.742,440817.5185,ALWOODLEY,METAL SQUARE,POSTBOX 4 SIDES WITH SELF CLOSING ASHTRAY,500MM X 500MM BALLAST ONLY,120 LITRES,LCC LOGO DOG WASTE ACCEPTED,JET BLACK - RAL 9005,GOOD,NONE,,,17/09/2021 00:00,MON,0,,,,,,,
74,AMBERLEY ROAD,O/S SECRET,GENERAL PATH - HIGH FOOT FALL,427473.6839,432608.4744,FARNLEY & WORTLEY,METAL SQUARE,POSTBOX 4 SIDES WITH FLAT TOP,BALLAST,120 LITRE,LCC LOGO DOG WASTE ACCEPTED,JET BLACK - RAL 9005,GOOD,NONE,P3,,12/10/2021 00:00,MON/WED/SAT,335,,,,,,,
75,AMBERTON ROAD,ENT TO LIDL,GENERAL PATH - HIGH FOOT FALL,433459.9469,435370.8055,GIPTON & HAREHILLS,METAL SQUARE,POSTBOX 4 SIDES WITH SELF CLOSING ASHTRAY,500MM X 500MM BALLAST ONLY,120 LITRES,LCC LOGO DOG WASTE ACCEPTED,JET BLACK - RAL 9005,GOOD,NONE,,,12/05/2018 00:00,WED/SUN,0,,,,,,,
76,AMBERTON ROAD,AT BUS STOP,BUS STOP OR SHELTER,433142.93,435609.17,GIPTON & HAREHILLS,METAL SQUARE,POSTBOX 4 SIDES WITH SELF CLOSING ASHTRAY,500MM X 500MM BALLAST ONLY,120 LITRES,LCC LOGO DOG WASTE ACCEPTED,JET BLACK - RAL 9005,GOOD,NONE,,,12/07/2018 00:00,WED/SUN,0,,,,,,,
77,AMRLEY ROAD,AT BUS STOP,BUS STOP OR SHELTER,427665.3077,433704.5011,ARMLEY,METAL SQUARE,POSTBOX ON 4 SIDES,BALLAST,120 LITRES,DOG WASTE ACCEPTED,BLACK,GOOD,NONE,,,04/04/2023 00:00,DAILY,0,,,,,,,
78,AMRLEY ROAD,@ BUS STOP,BUS STOP OR SHELTER,427408.2838,433671.8758,ARMLEY,METAL SQUARE,POSTBOX 4 SIDES WITH SELF CLOSING ASHTRAY,500MM X 500MM BALLAST ONLY,120 LITRES,LCC LOGO DOG WASTE ACCEPTED,JET BLACK - RAL 9005,GOOD,NONE,,,12/08/2018 00:00,DAILY,0,,,,,,,
79,APPLETON GREEN,ON PATH THROUGH FLATS,GENERAL PATH - HIGH FOOT FALL,431932.2044,433767.6656,BURMANTOFTS & RICHMOND HILL,METAL SQUARE,POSTBOX 4 SIDES WITH SELF CLOSING ASHTRAY,500MM X 500MM BALLAST ONLY,120 LITRES,LCC LOGO DOG WASTE ACCEPTED,JET BLACK - RAL 9005,GOOD,NONE,,,12/07/2011 00:00,MON,0,,,,,,,
80,ARGIE AVENUE,,GENERAL PATH - HIGH FOOT FALL,426819.88,435192.96,KIRKSTALL,METAL SQUARE,POSTBOX 4 SIDES WITH SELF CLOSING ASHTRAY,500MM X 500MM BALLAST ONLY,120 LITRES,LCC LOGO DOG WASTE ACCEPTED,JET BLACK - RAL 9005,GOOD,NONE,,,12/07/2018 00:00,WED/SUN,0,,,,,,,
81,ARGIE AVENUE,,GENERAL PATH - HIGH FOOT FALL,427528.83,435143.83,KIRKSTALL,METAL SQUARE,POSTBOX 4 SIDES WITH SELF CLOSING ASHTRAY,500MM X 500MM BALLAST ONLY,120 LITRES,LCC LOGO DOG WASTE ACCEPTED,JET BLACK - RAL 9005,GOOD,NONE,,,03/05/2018 00:00,WED/SUN,0,,,,,,,
82,ARGIE ROAD,,GENERAL PATH - HIGH FOOT FALL,427524.52,435395.5,KIRKSTALL,METAL SQUARE,POSTBOX 4 SIDES WITH SELF CLOSING ASHTRAY,500MM X 500MM BALLAST ONLY,120 LITRES,LCC LOGO DOG WASTE ACCEPTED,JET BLACK - RAL 9005,GOOD,NONE,,,03/05/2018 00:00,WED/SUN,0,,,,,,,
83,ARMLEY LODGE ROAD,O/S SCHOOL,SCHOOL/NURSERY,427178.17,433900.86,ARMLEY,METAL SQUARE,POSTBOX 4 SIDES WITH SELF CLOSING ASHTRAY,500MM X 500MM BALLAST ONLY,120 LITRES,LCC LOGO DOG WASTE ACCEPTED,JET BLACK - RAL 9005,GOOD,NONE,,,12/08/2018 00:00,MON/WED/SAT,0,,,,,,,
88,BACK LANE,CNR FRONT ST,GENERAL PATH - HIGH FOOT FALL,429742.22,432787.45,HUNSLET & RIVERSIDE,METAL SQUARE,POSTBOX 4 SIDES WITH SELF CLOSING ASHTRAY,500MM X 500MM BALLAST ONLY,120 LITRES,LCC LOGO DOG WASTE ACCEPTED,JET BLACK - RAL 9005,GOOD, NONE,CITY CENTRE MANAGEMENT,,22/09/2020 00:00,DAILY,0,,,,,,,
89,ARTHINGTON LANE,,GENERAL PATH - HIGH FOOT FALL,424751.84,445089.3,ADEL & WHARFEDALE,METAL TWIN,POSTBOX FRONT AND BACK,GROUND BOLTS,TWIN LINERS,LCC LOGO,GREY,FAIR,SURFACE RUST,,,11/06/2018 00:00,DAILY,0,,,,,,,
90,ARTHINGTON LANE,,GENERAL PATH - HIGH FOOT FALL,424625.06,445119.48,ADEL & WHARFEDALE,METAL TWIN,POSTBOX FRONT AND BACK,GROUND BOLTS,TWIN LINERS,LCC LOGO,GREY,FAIR,SURFACE RUST,,,11/06/2018 00:00,DAILY,0,,,,,,,
91,ARTHINGTON LANE,,GENERAL PATH - HIGH FOOT FALL,424622.0969,445108.3107,ADEL & WHARFEDALE,PLASTIC ROUND,OPEN TOP,GROUND BOLTS,80 LITRES,LCC LOGO,BLACK,FAIR,NONE,,,11/06/2018 00:00,DAILY,0,,,,,,,
92,ASH ROAD,,GENERAL PATH - HIGH FOOT FALL,427463.96,436145.51,HEADINGLEY & HYDE PARK,METAL SQUARE,POSTBOX 4 SIDES WITH SELF CLOSING ASHTRAY,500MM X 500MM BALLAST ONLY,120 LITRES,LCC LOGO DOG WASTE ACCEPTED,JET BLACK - RAL 9005,FAIR,NONE,,,25/06/2018 00:00,WED/SAT,0,,,,,,,
93,ASH ROAD,,GENERAL PATH - HIGH FOOT FALL,427600.73,436150.36,HEADINGLEY & HYDE PARK,METAL SQUARE,POSTBOX 4 SIDES WITH SELF CLOSING ASHTRAY,500MM X 500MM BALLAST ONLY,120 LITRES,LCC LOGO DOG WASTE ACCEPTED,JET BLACK - RAL 9005,GOOD,NONE,,,25/06/2018 00:00,WED/SAT,0,,,,,,,
94,ASHLEY ROAD,O/S BEST ONE,SHOPS/OFFICES,432032.67,434887.28,GIPTON & HAREHILLS,METAL SQUARE,POSTBOX 4 SIDES WITH SELF CLOSING ASHTRAY,500MM X 500MM BALLAST ONLY,120 LITRES,LCC LOGO DOG WASTE ACCEPTED,JET BLACK - RAL 9005,GOOD,NONE,,,12/07/2018 00:00,MON/THU,0,,,,,,,
95,ASHLEY ROAD,O/S COOP CAR PARK,GENERAL PATH - HIGH FOOT FALL,432074.2216,434897.1845,GIPTON & HAREHILLS,METAL SQUARE,POSTBOX 4 SIDES WITH SELF CLOSING ASHTRAY,500MM X 500MM BALLAST ONLY,120 LITRES,LCC LOGO DOG WASTE ACCEPTED,JET BLACK - RAL 9005,GOOD,NONE,,,12/07/2018 00:00,MON/THU,0,,,,,,,
96,ASHTON ROAD,ENT TO SCHOOL,SCHOOL/NURSERY,432041.83,435185.84,GIPTON & HAREHILLS,METAL SQUARE,POSTBOX 4 SIDES WITH SELF CLOSING ASHTRAY,500MM X 500MM BALLAST ONLY,120 LITRES,LCC LOGO DOG WASTE ACCEPTED,JET BLACK - RAL 9005,GOOD,NONE,,,12/07/2018 00:00,MON/THU,0,,,,,,,
97,ASKETT HILL,CNR ELMETE WAY,GENERAL PATH - HIGH FOOT FALL,433951.1002,436968.6805,ROUNDHAY,METAL TWIN,POSTBOX FRONT AND BACK,GROUND BOLTS,TWIN LINERS,LCC LOGO,GREY,FAIR,DOOR LOCK BROKEN,,,12/07/2018 00:00,MON/WED/SAT,0,,,,,,,
98,ASQUITH AVENUE,O/S SCHOOL,SCHOOL/NURSERY,425966.28,428271.47,MORLEY NORTH,METAL TWIN,POSTBOX FRONT AND BACK,GROUND BOLTS,TWIN LINERS,LCC LOGO,GREY,GOOD,NONE,,,12/07/2011 00:00,MON,0,,,,,,,
101,ASTLEY LANE,,GENERAL PATH - HIGH FOOT FALL,438945.35,429497.31,GARFORTH & SWILLINGTON,METAL SQUARE,POSTBOX 4 SIDES WITH SELF CLOSING ASHTRAY,500MM X 500MM BALLAST ONLY,120 LITRES,LCC LOGO DOG WASTE ACCEPTED,JET BLACK - RAL 9005,GOOD,NONE,,,16/04/2019 00:00,MON,0,,,,,,,