OBJECTID,ROAD_NAME,LOCATION,LOCATIONGROUP,EASTING,NORTHING,WARD,MODEL,APERTURE,FIXINGS,LINER,SIGNAGE,MAINCOLOUR,CONDITION,DEFECTS,ROUTE,COMMENTS,FREQUENCY,SEQUENCE
6,ABBEY ROAD,AT BUS STOP,BUS STOP OR SHELTER,425188.59,436538.37,KIRKSTALL,PLASTIC ROUND,OPEN TOP,GROUND BOLTS,80 LITRES,LCC LOGO,BLACK,POOR,NO LINER,,,MON/FRI,0
7,ABBEY ROAD,CORNER OF ABBEY WALK,GENERAL PATH - HIGH FOOT FALL,425933.23,436267.67,KIRKSTALL,METAL TWIN,POSTBOX FRONT AND BACK,GROUND BOLTS,TWIN LINERS,LCC LOGO,GREY,FAIR,NONE,,,DAILY,0
12,ABERFORD ROAD,,GENERAL PATH - HIGH FOOT FALL,436833.6,428982.02,ROTHWELL,METAL SQUARE,POSTBOX 4 SIDES WITH SELF CLOSING ASHTRAY,500MM X 500MM BALLAST ONLY,120 LITRES,LCC LOGO DOG WASTE ACCEPTED,JET BLACK - RAL 9005,GOOD,NONE,,,DAILY,0
41,ALBION PLACE,SNOW ROCK,SHOPS/OFFICES,430181.41,433599.99,LITTLE LONDON & WOODHOUSE,METAL SQUARE,POSTBOX 4 SIDES WITH SELF CLOSING ASHTRAY,500MM X 500MM BALLAST ONLY,120 LITRES,LCC LOGO DOG WASTE ACCEPTED,JET BLACK - RAL 9005,GOOD,NONE,CITY CENTRE MANAGEMENT,,DAILY,0
44,ALBION STREET,ENT TO CAR PARK,GENERAL PATH - HIGH FOOT FALL,426498.02,427826.61,MORLEY SOUTH,METAL SQUARE,POSTBOX 4 SIDES WITH SELF CLOSING ASHTRAY,500MM X 500MM BALLAST ONLY,120 LITRES,LCC LOGO DOG WASTE ACCEPTED,JET BLACK - RAL 9005,GOOD,NONE,,,DAILY,0
52,ALBION STREET,MCDONALDS,TAKEAWAY,430094.6,433910.68,LITTLE LONDON & WOODHOUSE,RECYCLING YELLOW,SINGLE ROUND POSTBOX OPENING IN FRONT,BALLAST,120 LITRES,EMPTY PLASTIC AND CANS - NOWT ELSE WITH RED/GREY PLASTIC BOTTLES LOGO,YELLOW- RAL 1023,GOOD,NONE,CITY CENTRE MANAGEMENT,,DAILY,0
59,ALBION STREET,THE CUBE,PUB,430063.33,433874.71,LITTLE LONDON & WOODHOUSE,METAL SQUARE,POSTBOX 4 SIDES WITH SELF CLOSING ASHTRAY,500MM X 500MM BALLAST ONLY,120 LITRES,LCC LOGO DOG WASTE ACCEPTED,JET BLACK - RAL 9005,GOOD,NONE,CITY CENTRE MANAGEMENT,,DAILY,0
70,ARMOURIES WAY,CNR OF BLACK BULL ST,GENERAL PATH - HIGH FOOT FALL,430729.85,433038.18,HUNSLET & RIVERSIDE,METAL SQUARE,POSTBOX 4 SIDES WITH SELF CLOSING ASHTRAY,500MM X 500MM BALLAST ONLY,120 LITRES,LCC LOGO DOG WASTE ACCEPTED,JET BLACK - RAL 9005,FAIR,FADED PAINTWORK,CITY CENTRE MANAGEMENT,,DAILY,0
73,ALWWODLEY LANE,ENT ECCUP RESERVOIR,MONUMENT/BENCH/POW/CAR PARK,429675.742,440817.5185,ALWOODLEY,METAL SQUARE,POSTBOX 4 SIDES WITH SELF CLOSING ASHTRAY,500MM X 500MM BALLAST ONLY,120 LITRES,LCC LOGO DOG WASTE ACCEPTED,JET BLACK - RAL 9005,GOOD,NONE,,,WEEKLY,0
82,ARGIE ROAD,,GENERAL PATH - HIGH FOOT FALL,427524.52,435395.5,KIRKSTALL,METAL SQUARE,POSTBOX 4 SIDES WITH SELF CLOSING ASHTRAY,500MM X 500MM BALLAST ONLY,120 LITRES,LCC LOGO DOG WASTE ACCEPTED,JET BLACK - RAL 9005,GOOD,NONE,,,WED/SUN,0
86,ARMLEY RIDGE ROAD,,GENERAL PATH - HIGH FOOT FALL,426637.06,433550.35,ARMLEY,METAL TWIN,POSTBOX FRONT AND BACK,GROUND BOLTS,TWIN LINERS,LCC LOGO,GREY,POOR,NO LOCK,,,DAILY,0
89,ARTHINGTON LANE,,GENERAL PATH - HIGH FOOT FALL,424751.84,445089.3,ADEL & WHARFEDALE,METAL TWIN,POSTBOX FRONT AND BACK,GROUND BOLTS,TWIN LINERS,LCC LOGO,GREY,FAIR,SURFACE RUST,,,DAILY,0
110,AUSTHORPE ROAD,,GENERAL PATH - HIGH FOOT FALL,436373.56,434706.27,CROSSGATES & WHINMOOR,METAL SQUARE,POSTBOX 4 SIDES WITH SELF CLOSING ASHTRAY,500MM X 500MM BALLAST ONLY,120 LITRES,LCC LOGO DOG WASTE ACCEPTED,JET BLACK - RAL 9005,GOOD,NONE,,,MON/FRI,0
114,AUSTHORPE ROAD,,GENERAL PATH - HIGH FOOT FALL,436718.82,434714.09,CROSSGATES & WHINMOOR,METAL SQUARE,POSTBOX 4 SIDES WITH SELF CLOSING ASHTRAY,500MM X 500MM BALLAST ONLY,120 LITRES,LCC LOGO DOG WASTE ACCEPTED,JET BLACK - RAL 9005,GOOD,NONE,,,MON/FRI,0
115,AUSTHORPE ROAD,JCT RING ROAD,GENERAL PATH - HIGH FOOT FALL,436181.46,435061.53,CROSSGATES & WHINMOOR,METAL SQUARE,POSTBOX 4 SIDES WITH SELF CLOSING ASHTRAY,500MM X 500MM BALLAST ONLY,120 LITRES,LCC LOGO DOG WASTE ACCEPTED,JET BLACK - RAL 9005,GOOD,NONE,,,TUE/THU,0
125,BALM ROAD,O/S SHOPS,SHOPS/OFFICES,430992.08,430714.39,HUNSLET & RIVERSIDE,METAL SQUARE,POSTBOX 4 SIDES WITH SELF CLOSING ASHTRAY,500MM X 500MM BALLAST ONLY,120 LITRES,LCC LOGO DOG WASTE ACCEPTED,JET BLACK - RAL 9005,FAIR,NONE,,,FRI,0
127,BACK LANE,,GENERAL PATH - HIGH FOOT FALL,418770.44,441744.85,GUISELEY & RAWDON,METAL SQUARE,POSTBOX 4 SIDES WITH SELF CLOSING ASHTRAY,500MM X 500MM BALLAST ONLY,120 LITRES,LCC LOGO DOG WASTE ACCEPTED,JET BLACK - RAL 9005,GOOD,NONE,,,MON/THU/SUN,0
138,BAGLEY LANE,,GENERAL PATH - HIGH FOOT FALL,421839.55,435521.93,CALVERLEY & FARSLEY,METAL SQUARE,POSTBOX 4 SIDES WITH SELF CLOSING ASHTRAY,500MM X 500MM BALLAST ONLY,120 LITRES,LCC LOGO DOG WASTE ACCEPTED,JET BLACK - RAL 9005,GOOD,NONE,,,SUNDAY,0
155,BARLEYMILL CARPARK,,GENERAL PATH - HIGH FOOT FALL,440515.75,433055.31,GARFORTH & SWILLINGTON,METAL SQUARE,POSTBOX 4 SIDES WITH SELF CLOSING ASHTRAY,500MM X 500MM BALLAST ONLY,120 LITRES,LCC LOGO DOG WASTE ACCEPTED,JET BLACK - RAL 9005,GOOD,NONE,,,WEDNESDAY,0
156,BARLEYMILL CARPARK,,GENERAL PATH - HIGH FOOT FALL,440364.39,433128.53,GARFORTH & SWILLINGTON,METAL TWIN,POSTBOX FRONT AND BACK,GROUND BOLTS,TWIN LINERS,LCC LOGO,GREY,POOR,RUST,,,DAILY,0
161,BEZA STREET,O/S RETAIL PARK,SHOPS/OFFICES,430655.02,431209.33,HUNSLET & RIVERSIDE,METAL TWIN,POSTBOX FRONT AND BACK,GROUND BOLTS,TWIN LINERS,LCC LOGO,GREY,FAIR,NONE,,,FRIDAY,0
167,BARWICK ROAD,OPP TRIM TRAIL ENT,GENERAL PATH - HIGH FOOT FALL,437228.52,435756.88,CROSSGATES & WHINMOOR,METAL SQUARE,POSTBOX 4 SIDES WITH SELF CLOSING ASHTRAY,500MM X 500MM BALLAST ONLY,120 LITRES,LCC LOGO DOG WASTE ACCEPTED,JET BLACK - RAL 9005,GOOD,NONE,,,MON/FRI,0
178,BEDFORD DRIVE,,GENERAL PATH - HIGH FOOT FALL,425236.03,439280.25,WEETWOOD,METAL SQUARE,POSTBOX 4 SIDES WITH SELF CLOSING ASHTRAY,500MM X 500MM BALLAST ONLY,120 LITRES,LCC LOGO DOG WASTE ACCEPTED,JET BLACK - RAL 9005,GOOD,NONE,,,MON/WED/FRI,0
184,BISHOPGATE STREET,BUS STOPS UNDER QUEENS HOTEL,BUS STOP OR SHELTER,429938.58,433362.45,HUNSLET & RIVERSIDE,METAL SQUARE,POSTBOX 4 SIDES WITH SELF CLOSING ASHTRAY,500MM X 500MM BALLAST ONLY,120 LITRES,LCC LOGO DOG WASTE ACCEPTED,JET BLACK - RAL 9005,GOOD,NONE,CITY CENTRE MANAGEMENT,,DAILY,0
187,BISHOPGATE STREET,O/S THE BLACK PRINCE PUB,PUB,429943.29,433400.87,LITTLE LONDON & WOODHOUSE,COMPACTING SOLAR,POSTBOX FRONT PULLDOWN LOADING TRAY,BALLAST,120 LITRES,LCC LOGO GENERAL WASTE,BLACK,GOOD,NONE,CITY CENTRE MANAGEMENT,,DAILY,0
191,BELLE ISLE CIRCUS,,GENERAL PATH - HIGH FOOT FALL,431144.72,429949.7,MIDDLETON PARK,METAL SQUARE,POSTBOX 4 SIDES WITH SELF CLOSING ASHTRAY,500MM X 500MM BALLAST ONLY,120 LITRES,LCC LOGO DOG WASTE ACCEPTED,JET BLACK - RAL 9005,GOOD,NONE,,,DAILY,0
197,BLACKMAN LANE,ENT. TO PARK,MONUMENT/BENCH/POW/CAR PARK,429952.51,434771.38,LITTLE LONDON & WOODHOUSE,METAL SQUARE,POSTBOX 4 SIDES WITH SELF CLOSING ASHTRAY,500MM X 500MM BALLAST ONLY,120 LITRES,LCC LOGO DOG WASTE ACCEPTED,JET BLACK - RAL 9005,GOOD,NONE,,,SUNDAY,0
200,BOAR LANE,BAR BURRITO,TAKEAWAY,430091.59,433377.79,LITTLE LONDON & WOODHOUSE,METAL SQUARE,POSTBOX 4 SIDES WITH SELF CLOSING ASHTRAY,500MM X 500MM BALLAST ONLY,120 LITRES,LCC LOGO DOG WASTE ACCEPTED,JET BLACK - RAL 9005,GOOD,NONE,CITY CENTRE MANAGEMENT,,DAILY,0
210,BELLE ISLE ROAD,SCHOOL ENTERANCE,SCHOOL/NURSERY,431292.38,429553.15,MIDDLETON PARK,METAL SQUARE,POSTBOX 4 SIDES WITH SELF CLOSING ASHTRAY,500MM X 500MM BALLAST ONLY,120 LITRES,LCC LOGO DOG WASTE ACCEPTED,JET BLACK - RAL 9005,GOOD,NONE,,,MONDAY,0
227,BOAR LANE,MCDONALDS,TAKEAWAY,430215.74,433406.83,LITTLE LONDON & WOODHOUSE,METAL SQUARE,POSTBOX 4 SIDES WITH SELF CLOSING ASHTRAY,500MM X 500MM BALLAST ONLY,120 LITRES,LCC LOGO DOG WASTE ACCEPTED,JET BLACK - RAL 9005,GOOD,NONE,CITY CENTRE MANAGEMENT,,DAILY,0
228,BILLING VIEW,IN CAR PARK,MONUMENT/BENCH/POW/CAR PARK,421670.2,439533.89,HORSFORTH,METAL SQUARE,POSTBOX 4 SIDES WITH SELF CLOSING ASHTRAY,500MM X 500MM BALLAST ONLY,120 LITRES,LCC LOGO DOG WASTE ACCEPTED,JET BLACK - RAL 9005,GOOD,NONE,,,TUE/THU/SAT,0
229,BIRCH DRIVE,ON PATH,GENERAL PATH - HIGH FOOT FALL,441000.88,431152.86,KIPPAX & METHLEY,METAL SQUARE,POSTBOX 4 SIDES WITH SELF CLOSING ASHTRAY,500MM X 500MM BALLAST ONLY,120 LITRES,LCC LOGO DOG WASTE ACCEPTED,JET BLACK - RAL 9005,GOOD,NONE,,,TUESDAY,0
239,BLACK HILL ROAD,NEXT TO BENCH,GENERAL PATH - HIGH FOOT FALL,427281.34,444640.81,OTLEY & YEADON,PLASTIC POST,POSTBOX FRONT,METAL STRAP,80 LITRES,LCC LOGO,YELLOW- RAL 1023,POOR,NONE,,,FRIDAY,0
244,BOAR LANE,WILLIAM HILL,SHOPS/OFFICES,430083.4,433359.08,HUNSLET & RIVERSIDE,COMPACTING SOLAR,POSTBOX FRONT PULLDOWN LOADING TRAY,BALLAST,120 LITRES,LCC LOGO GENERAL WASTE,BLACK,GOOD,NONE,CITY CENTRE MANAGEMENT,,DAILY,0
253,BRIGGATE,COUNTY ARCADE,SHOPS/OFFICES,430265.22,433662.72,LITTLE LONDON & WOODHOUSE,METAL SQUARE,POSTBOX 4 SIDES WITH SELF CLOSING ASHTRAY,500MM X 500MM BALLAST ONLY,120 LITRES,LCC LOGO DOG WASTE ACCEPTED,JET BLACK - RAL 9005,GOOD,NONE,CITY CENTRE MANAGEMENT,,DAILY,0
265,BODMIN CRESCENT,O/S SCHOOL,SCHOOL/NURSERY,429292.58,428003.57,MIDDLETON PARK,METAL SQUARE,POSTBOX 4 SIDES WITH SELF CLOSING ASHTRAY,500MM X 500MM BALLAST ONLY,120 LITRES,LCC LOGO DOG WASTE ACCEPTED,JET BLACK - RAL 9005,GOOD,NONE,,,DAILY,0
272,BOGGART HILL DRIVE,AT BUS SHELTER,BUS STOP OR SHELTER,434613.67,436850.67,KILLINGBECK & SEACROFT,METAL SQUARE,POSTBOX 4 SIDES WITH SELF CLOSING ASHTRAY,500MM X 500MM BALLAST ONLY,120 LITRES,LCC LOGO DOG WASTE ACCEPTED,JET BLACK - RAL 9005,GOOD,NONE,,,WEEKLY,0
277,BOGGART HILL DRIVE,CNR KENTMERE AVE,SHOPS/OFFICES,434997.6166,436906.584,KILLINGBECK & SEACROFT,METAL SQUARE,POSTBOX 4 SIDES WITH SELF CLOSING ASHTRAY,500MM X 500MM BALLAST ONLY,120 LITRES,LCC LOGO DOG WASTE ACCEPTED,JET BLACK - RAL 9005,GOOD,NONE,,,WEEKLY,0
283,BONDGATE,OPP FIRE STATION,GENERAL PATH - HIGH FOOT FALL,420297.3026,445370.0266,OTLEY & YEADON,METAL SQUARE,POSTBOX 4 SIDES WITH SELF CLOSING ASHTRAY,500MM X 500MM BALLAST ONLY,120 LITRES,LCC LOGO DOG WASTE ACCEPTED,JET BLACK - RAL 9005,FAIR,RUSTY BASE,,,DAILY,0
291,BOSTON ROAD,RIVER BANK,GENERAL PATH - HIGH FOOT FALL,440454.19,448017.37,WETHERBY,METAL SQUARE,POSTBOX 4 SIDES WITH SELF CLOSING ASHTRAY,500MM X 500MM BALLAST ONLY,120 LITRES,LCC LOGO DOG WASTE ACCEPTED,JET BLACK - RAL 9005,GOOD,NONE,,,WEEKLY,0
296,BRIGGATE,MARKS & SPENCER,SHOPS/OFFICES,430226.1,433483.54,LITTLE LONDON & WOODHOUSE,METAL SQUARE,POSTBOX 4 SIDES WITH SELF CLOSING ASHTRAY,500MM X 500MM BALLAST ONLY,120 LITRES,LCC LOGO DOG WASTE ACCEPTED,JET BLACK - RAL 9005,GOOD,NONE,CITY CENTRE MANAGEMENT,,DAILY,0
319,BRADFORD ROAD,AT BUS STOP,BUS STOP OR SHELTER,428817.1608,426003.1073,ARDSLEY & ROBIN HOOD,METAL SQUARE,POSTBOX 4 SIDES WITH SELF CLOSING ASHTRAY,500MM X 500MM BALLAST ONLY,120 LITRES,LCC LOGO,JET BLACK - RAL 9005,GOOD,NONE,,,,0
331,BRADFORD ROAD,,GENERAL PATH - HIGH FOOT FALL,418785.03,444773.14,OTLEY & YEADON,METAL SQUARE,POSTBOX 4 SIDES WITH SELF CLOSING ASHTRAY,500MM X 500MM BALLAST ONLY,120 LITRES,LCC LOGO DOG WASTE ACCEPTED,JET BLACK - RAL 9005,GOOD,NONE,,,FRIDAY,0
349,BRADFORD ROAD,OPP RICHARDSHAW LN,GENERAL PATH - HIGH FOOT FALL,422008.17,434380.62,CALVERLEY & FARSLEY,METAL SQUARE,POSTBOX 4 SIDES WITH SELF CLOSING ASHTRAY,500MM X 500MM BALLAST ONLY,120 LITRES,LCC LOGO DOG WASTE ACCEPTED,JET BLACK - RAL 9005,GOOD,NONE,,,MONDAY,0
362,BREARY LANE,NR CENOTAPH,MONUMENT/BENCH/POW/CAR PARK,425030.49,443245.09,ADEL & WHARFEDALE,METAL OPEN,OPEN TOP,GROUND BOLTS,80 LITRES,LCC LOGO,BLACK,FAIR,NONE,,WOODEN SIDES,TUE/THU,0
367,BRIGGATE,SAMSUNG,SHOPS/OFFICES,430274.05,433717.3,LITTLE LONDON & WOODHOUSE,METAL SQUARE,POSTBOX 4 SIDES WITH SELF CLOSING ASHTRAY,500MM X 500MM BALLAST ONLY,120 LITRES,LCC LOGO DOG WASTE ACCEPTED,JET BLACK - RAL 9005,GOOD,NONE,CITY CENTRE MANAGEMENT,,DAILY,0
372,BRIDGE ROAD,OVER BRIDGE,GENERAL PATH - HIGH FOOT FALL,422293.87,436473.03,CALVERLEY & FARSLEY,METAL SQUARE,POSTBOX 4 SIDES WITH SELF CLOSING ASHTRAY,500MM X 500MM BALLAST ONLY,120 LITRES,LCC LOGO DOG WASTE ACCEPTED,JET BLACK - RAL 9005,GOOD,NONE,,,SATURDAY,0
378,BRIDGE STREET,,GENERAL PATH - HIGH FOOT FALL,420220.28,445706.26,OTLEY & YEADON,METAL OPEN,OPEN TOP,GROUND BOLTS,80 LITRES,LCC LOGO,BLACK,POOR,NONE,,,DAILY,0
380,BRIDGE STREET,AT BUS SHELTER,BUS STOP OR SHELTER,426777.62,426759.77,MORLEY SOUTH,METAL SQUARE,POSTBOX 4 SIDES WITH SELF CLOSING ASHTRAY,500MM X 500MM BALLAST ONLY,120 LITRES,LCC LOGO DOG WASTE ACCEPTED,JET BLACK - RAL 9005,GOOD,NONE,,,WEEKLY,0
397,BURLEY ROAD,O/S MANJAROS,TAKEAWAY,428794.85,434048.74,LITTLE LONDON & WOODHOUSE,METAL SQUARE,POSTBOX 4 SIDES WITH SELF CLOSING ASHTRAY,500MM X 500MM BALLAST ONLY,120 LITRES,LCC LOGO DOG WASTE ACCEPTED,JET BLACK - RAL 9005,FAIR,NO LOCK,,WAS O/S ROYAL PARK,DAILY,0
400,BURLEY ROAD,OPP STUDIO RD,GENERAL PATH - HIGH FOOT FALL,428518.22,434314.68,LITTLE LONDON & WOODHOUSE,METAL SQUARE,POSTBOX 4 SIDES WITH SELF CLOSING ASHTRAY,500MM X 500MM BALLAST ONLY,120 LITRES,LCC LOGO DOG WASTE ACCEPTED,JET BLACK - RAL 9005,GOOD,NONE,,,DAILY,0
408,BURTON ROW,,GENERAL PATH - HIGH FOOT FALL,430263.84,431567.05,HUNSLET & RIVERSIDE,METAL TWIN,POSTBOX FRONT AND BACK,GROUND BOLTS,TWIN LINERS,LCC LOGO,GREY,FAIR,NONE,,,TUESDAY,0
410,BURTON ROW,,GENERAL PATH - HIGH FOOT FALL,430524.2,431422.5,HUNSLET & RIVERSIDE,METAL SQUARE,POSTBOX 4 SIDES WITH SELF CLOSING ASHTRAY,500MM X 500MM BALLAST ONLY,120 LITRES,LCC LOGO DOG WASTE ACCEPTED,JET BLACK - RAL 9005,GOOD,NONE,,,TUESDAY,0
430,CALVERLEY STREET,CORNER OF MUSEUM,GENERAL PATH - HIGH FOOT FALL,429804.89,433832.23,LITTLE LONDON & WOODHOUSE,METAL SQUARE,POSTBOX 4 SIDES WITH SELF CLOSING ASHTRAY,500MM X 500MM BALLAST ONLY,120 LITRES,LCC LOGO DOG WASTE ACCEPTED,JET BLACK - RAL 9005,GOOD,NONE,CITY CENTRE MANAGEMENT,,DAILY,0
432,BROADGATE LANE,O/S SHOPS,SHOPS/OFFICES,424449.83,438114.02,HORSFORTH,METAL SQUARE,POSTBOX 4 SIDES WITH SELF CLOSING ASHTRAY,500MM X 500MM BALLAST ONLY,120 LITRES,LCC LOGO DOG WASTE ACCEPTED,JET BLACK - RAL 9005,GOOD,NONE,,,TUE/THU/SAT,0
433,BROADGATE WALK,,GENERAL PATH - HIGH FOOT FALL,424467.21,437973.66,HORSFORTH,METAL SQUARE,POSTBOX 4 SIDES WITH SELF CLOSING ASHTRAY,500MM X 500MM BALLAST ONLY,120 LITRES,LCC LOGO DOG WASTE ACCEPTED,JET BLACK - RAL 9005,GOOD,NONE,,,TUE/THU/SAT,0
435,BROADLEA AVENUE,,GENERAL PATH - HIGH FOOT FALL,425088.95,435780.49,BRAMLEY & STANNINGLEY,METAL SQUARE,POSTBOX 4 SIDES WITH SELF CLOSING ASHTRAY,500MM X 500MM BALLAST ONLY,120 LITRES,LCC LOGO DOG WASTE ACCEPTED,JET BLACK - RAL 9005,GOOD,NONE,,,MONDAY,0
437,BROADLEA GROVE,,GENERAL PATH - HIGH FOOT FALL,425112.77,435947.18,BRAMLEY & STANNINGLEY,METAL SQUARE,POSTBOX 4 SIDES WITH SELF CLOSING ASHTRAY,500MM X 500MM BALLAST ONLY,120 LITRES,LCC LOGO DOG WASTE ACCEPTED,JET BLACK - RAL 9005,GOOD,NONE,,,MONDAY,0
440,BROADLEA HILL,,GENERAL PATH - HIGH FOOT FALL,425223.89,435715.4,BRAMLEY & STANNINGLEY,METAL SQUARE,POSTBOX 4 SIDES WITH SELF CLOSING ASHTRAY,500MM X 500MM BALLAST ONLY,120 LITRES,LCC LOGO DOG WASTE ACCEPTED,JET BLACK - RAL 9005,GOOD,NONE,,,MONDAY,0
446,BROADLEA TERRACE,,GENERAL PATH - HIGH FOOT FALL,425666.81,435466.16,BRAMLEY & STANNINGLEY,METAL SQUARE,POSTBOX 4 SIDES WITH SELF CLOSING ASHTRAY,500MM X 500MM BALLAST ONLY,120 LITRES,LCC LOGO DOG WASTE ACCEPTED,JET BLACK - RAL 9005,GOOD,NONE,,,MONDAY,0
449,BROADWAY,,GENERAL PATH - HIGH FOOT FALL,424658.57,437783.95,HORSFORTH,METAL SQUARE,POSTBOX 4 SIDES WITH SELF CLOSING ASHTRAY,500MM X 500MM BALLAST ONLY,120 LITRES,LCC LOGO DOG WASTE ACCEPTED,JET BLACK - RAL 9005,GOOD,NONE,,,TUE/THU/SAT,0
468,BROWNBERRIE LANE,,GENERAL PATH - HIGH FOOT FALL,423309.05,439328.56,HORSFORTH,METAL SQUARE,POSTBOX 4 SIDES WITH SELF CLOSING ASHTRAY,500MM X 500MM BALLAST ONLY,120 LITRES,LCC LOGO DOG WASTE ACCEPTED,JET BLACK - RAL 9005,GOOD,NONE,,,TUE/THU/SAT,0
473,BRUDENELL ROAD,O/S PARADE OF SHOPS,SHOPS/OFFICES,428508.71,435228.91,HEADINGLEY & HYDE PARK,METAL SQUARE,POSTBOX 4 SIDES WITH SELF CLOSING ASHTRAY,500MM X 500MM BALLAST ONLY,120 LITRES,LCC LOGO DOG WASTE ACCEPTED,JET BLACK - RAL 9005,GOOD,NONE,,,DAILY,0
486,BURLEY ROAD,AT BUS STOP,BUS STOP OR SHELTER,427258.45,435186.45,KIRKSTALL,METAL SQUARE,POSTBOX 4 SIDES WITH SELF CLOSING ASHTRAY,500MM X 500MM BALLAST ONLY,120 LITRES,LCC LOGO DOG WASTE ACCEPTED,JET BLACK - RAL 9005,GOOD,NONE,,,WED/SUN,0
487,AUSTHORPE ROAD,,GENERAL PATH - HIGH FOOT FALL,436323,434686,CROSSGATES & WHINMOOR,METAL SQUARE,POSTBOX 4 SIDES WITH SELF CLOSING ASHTRAY,500MM X 500MM BALLAST ONLY,120 LITRES,LCC LOGO DOG WASTE ACCEPTED,JET BLACK - RAL 9005,GOOD,NONE,,,MON/FRI,0
496,CARDIGAN ROAD,,GENERAL PATH - HIGH FOOT FALL,428108.59,434668.4,LITTLE LONDON & WOODHOUSE,METAL TWIN,POSTBOX FRONT AND BACK,GROUND BOLTS,TWIN LINERS,LCC LOGO,GREY,FAIR,NONE,,,DAILY,0
503,CASTLE STREET,IN CAR PARK,MONUMENT/BENCH/POW/CAR PARK,429225.85,433509.96,LITTLE LONDON & WOODHOUSE,METAL SQUARE,POSTBOX 4 SIDES WITH SELF CLOSING ASHTRAY,500MM X 500MM BALLAST ONLY,120 LITRES,LCC LOGO DOG WASTE ACCEPTED,JET BLACK - RAL 9005,GOOD,NONE,CITY CENTRE MANAGEMENT,,DAILY,0
508,BURRAS LANE,,GENERAL PATH - HIGH FOOT FALL,419911.43,445160.29,OTLEY & YEADON,METAL TWIN,POSTBOX FRONT AND BACK,GROUND BOLTS,TWIN LINERS,LCC LOGO,GREY,FAIR,NONE,,,FRIDAY,0
510,AUSTHORPE VIEW,,GENERAL PATH - HIGH FOOT FALL,436874.19,433697.08,CROSSGATES & WHINMOOR,METAL SQUARE,POSTBOX 4 SIDES WITH SELF CLOSING ASHTRAY,500MM X 500MM BALLAST ONLY,120 LITRES,LCC LOGO DOG WASTE ACCEPTED,JET BLACK - RAL 9005,GOOD,NONE,,,DAILY,0
533,BELLE ISLE CIRCUS,,GENERAL PATH - HIGH FOOT FALL,431221.42,429852.38,MIDDLETON PARK,METAL SQUARE,POSTBOX 4 SIDES WITH SELF CLOSING ASHTRAY,500MM X 500MM BALLAST ONLY,120 LITRES,LCC LOGO DOG WASTE ACCEPTED,JET BLACK - RAL 9005,GOOD,NONE,,,MONDAY,0
536,CHADWICK STREET,OPP MAGELLEN HOUSE ENT,SHOPS/OFFICES,430735.96,432906.92,HUNSLET & RIVERSIDE,METAL SQUARE,POSTBOX 4 SIDES WITH SELF CLOSING ASHTRAY,500MM X 500MM BALLAST ONLY,120 LITRES,LCC LOGO DOG WASTE ACCEPTED,JET BLACK - RAL 9005,FAIR,FADED PAINTWORK,CITY CENTRE MANAGEMENT,,DAILY,0
538,CALVERLEY LANE,NEXT TO CANAL,GENERAL PATH - HIGH FOOT FALL,422188.18,436823.15,CALVERLEY & FARSLEY,PLASTIC ROUND,OPEN TOP,GROUND BOLTS,80 LITRES,LCC LOGO,,FAIR,NONE,,BLACK,SATURDAY,0
539,CALVERLEY LANE,END OF PATH,MONUMENT/BENCH/POW/CAR PARK,422160.58,437045.3,HORSFORTH,METAL SQUARE,POSTBOX 4 SIDES WITH SELF CLOSING ASHTRAY,500MM X 500MM BALLAST ONLY,120 LITRES,LCC LOGO DOG WASTE ACCEPTED,JET BLACK - RAL 9005,GOOD,NONE,,,TUE/THU/SAT,0
544,CALVERLEY LANE,O/S CEMETERY,MONUMENT/BENCH/POW/CAR PARK,423024.95,437519.6,HORSFORTH,PLASTIC POST,POSTBOX FRONT,METAL STRAP,80 LITRES,LCC LOGO,YELLOW- RAL 1023,FAIR,NONE,,,TUE/THU/SAT,0
546,CALVERLEY ROAD,,GENERAL PATH - HIGH FOOT FALL,436342.83,428320.59,ROTHWELL,METAL SQUARE,POSTBOX 4 SIDES WITH SELF CLOSING ASHTRAY,500MM X 500MM BALLAST ONLY,120 LITRES,LCC LOGO DOG WASTE ACCEPTED,JET BLACK - RAL 9005,GOOD,NONE,,,DAILY,0
562,CANAL STREET,,GENERAL PATH - HIGH FOOT FALL,428442.26,433326.77,ARMLEY,METAL TWIN,POSTBOX FRONT AND BACK,GROUND BOLTS,TWIN LINERS,LCC LOGO,GREY,GOOD,NONE,,,MON/THU/SAT,0
563,CANTERBURY DRIVE,,GENERAL PATH - HIGH FOOT FALL,427308.35,435948.78,HEADINGLEY & HYDE PARK,METAL TWIN,POSTBOX FRONT AND BACK,GROUND BOLTS,TWIN LINERS,LCC LOGO,GREY,POOR,NO DOOR,,,SATURDAY,0
572,CARDIGAN ROAD,O/S BEAR PIT,MONUMENT/BENCH/POW/CAR PARK,428023.59,435509.56,HEADINGLEY & HYDE PARK,METAL SQUARE,POSTBOX 4 SIDES WITH SELF CLOSING ASHTRAY,500MM X 500MM BALLAST ONLY,120 LITRES,LCC LOGO DOG WASTE ACCEPTED,JET BLACK - RAL 9005,GOOD,NONE,,,WEDNESDAY,0
581,CARLTON LANE,NR PHARMACY,SHOPS/OFFICES,433304.0512,426167.8357,ARDSLEY & ROBIN HOOD,METAL SQUARE,POSTBOX 4 SIDES WITH SELF CLOSING ASHTRAY,500MM X 500MM BALLAST ONLY,120 LITRES,LCC LOGO DOG WASTE ACCEPTED,JET BLACK - RAL 9005,GOOD,NONE,,,WEEKLY,0
583,CARLTON LANE,,GENERAL PATH - HIGH FOOT FALL,434163.66,427746.84,ROTHWELL,METAL SQUARE,POSTBOX 4 SIDES WITH SELF CLOSING ASHTRAY,500MM X 500MM BALLAST ONLY,120 LITRES,LCC LOGO DOG WASTE ACCEPTED,JET BLACK - RAL 9005,GOOD,NONE,,,DAILY,0
594,CARR ROAD,,GENERAL PATH - HIGH FOOT FALL,420550.2,437092.43,CALVERLEY & FARSLEY,METAL OPEN,OPEN TOP,GROUND BOLTS,80 LITRES,LCC LOGO,BLACK,FAIR,NONE,,,SATURDAY,0
596,CARR ROAD,JCT WITH CARR WOOD GARDENS,GENERAL PATH - HIGH FOOT FALL,420159.21,437099.45,PUDSEY,METAL TWIN,POSTBOX FRONT AND BACK,GROUND BOLTS,TWIN LINERS,LCC LOGO,GREY,FAIR,NONE,,,SATURDAY,0
602,CASTLE LODGE AVENUE,END OF PATH,MONUMENT/BENCH/POW/CAR PARK,433146.75,429064.07,ROTHWELL,METAL SQUARE,POSTBOX 4 SIDES WITH SELF CLOSING ASHTRAY,500MM X 500MM BALLAST ONLY,120 LITRES,LCC LOGO DOG WASTE ACCEPTED,JET BLACK - RAL 9005,GOOD,NONE,,,DAILY,0
604,CITY SQUARE,PEDESTRIAN AREA,SHOPS/OFFICES,429952.56,433415.34,LITTLE LONDON & WOODHOUSE,METAL SQUARE,POSTBOX 4 SIDES WITH SELF CLOSING ASHTRAY,500MM X 500MM BALLAST ONLY,120 LITRES,LCC LOGO DOG WASTE ACCEPTED,JET BLACK - RAL 9005,GOOD,NONE,CITY CENTRE MANAGEMENT,,DAILY,0
616,CEMETERY ROAD,AT BUS STOP,GENERAL PATH - HIGH FOOT FALL,429167.29,431606.11,BEESTON & HOLBECK,METAL SQUARE,POSTBOX 4 SIDES WITH SELF CLOSING ASHTRAY,500MM X 500MM BALLAST ONLY,120 LITRES,LCC LOGO DOG WASTE ACCEPTED,JET BLACK - RAL 9005,GOOD,NONE,,,MONDAY,0
624,CEMETERY ROAD,VIEWING POINT,GENERAL PATH - HIGH FOOT FALL,421548.01,441908.43,OTLEY & YEADON,METAL SQUARE,POSTBOX 4 SIDES WITH SELF CLOSING ASHTRAY,500MM X 500MM BALLAST ONLY,120 LITRES,LCC LOGO DOG WASTE ACCEPTED,JET BLACK - RAL 9005,GOOD,NONE,,,DAILY,0
632,BILLING VIEW,CAR PARK,MONUMENT/BENCH/POW/CAR PARK,421645.5,439505.67,HORSFORTH,METAL SQUARE,POSTBOX 4 SIDES WITH SELF CLOSING ASHTRAY,500MM X 500MM BALLAST ONLY,120 LITRES,LCC LOGO DOG WASTE ACCEPTED,JET BLACK - RAL 9005,GOOD,NONE,,,TUE/THU/SAT,0
646,CHAPEL STREET,,GENERAL PATH - HIGH FOOT FALL,435368.7,438946.57,TEMPLE NEWSAM,METAL SQUARE,POSTBOX 4 SIDES WITH SELF CLOSING ASHTRAY,500MM X 500MM BALLAST ONLY,120 LITRES,LCC LOGO DOG WASTE ACCEPTED,JET BLACK - RAL 9005,GOOD,NONE,,,MON,0
653,CHAPELTOWN,,GENERAL PATH - HIGH FOOT FALL,421882.29,432967.79,PUDSEY,METAL SQUARE,POSTBOX 4 SIDES WITH SELF CLOSING ASHTRAY,500MM X 500MM BALLAST ONLY,120 LITRES,LCC LOGO DOG WASTE ACCEPTED,JET BLACK - RAL 9005,GOOD,NONE,,,FRIDAY,0
667,CHARTIST WAY,AT BUS STOP,BUS STOP OR SHELTER,426246.88,427401.13,MORLEY SOUTH,METAL SQUARE,POSTBOX 4 SIDES WITH FLAT TOP,500MM X 500MM BALLAST ONLY,120 LITRES,LCC LOGO DOG WASTE ACCEPTED,JET BLACK - RAL 9005,GOOD,NONE,,,WEEKLY,0
690,CHURCH LANE,,GENERAL PATH - HIGH FOOT FALL,440478.42,433051.86,GARFORTH & SWILLINGTON,METAL TWIN,POSTBOX FRONT AND BACK,GROUND BOLTS,TWIN LINERS,LCC LOGO,GREY,FAIR,NONE,,,WEDNESDAY,0
711,BRADFORD ROAD,CORNER MOORLAND CR,GENERAL PATH - HIGH FOOT FALL,417974.9,442908.81,GUISELEY & RAWDON,METAL SQUARE,POSTBOX 4 SIDES WITH SELF CLOSING ASHTRAY,500MM X 500MM BALLAST ONLY,120 LITRES,LCC LOGO DOG WASTE ACCEPTED,JET BLACK - RAL 9005,GOOD,NONE,,,MON/THU/SUN,0
712,BRADFORD ROAD,,GENERAL PATH - HIGH FOOT FALL,419363.98,444976.97,OTLEY & YEADON,METAL SQUARE,POSTBOX 4 SIDES WITH SELF CLOSING ASHTRAY,500MM X 500MM BALLAST ONLY,120 LITRES,LCC LOGO DOG WASTE ACCEPTED,JET BLACK - RAL 9005,GOOD,NONE,,,FRIDAY,0
716,BRADFORD ROAD,,GENERAL PATH - HIGH FOOT FALL,421202.62,434455.83,CALVERLEY & FARSLEY,METAL SQUARE,POSTBOX 4 SIDES WITH SELF CLOSING ASHTRAY,500MM X 500MM BALLAST ONLY,120 LITRES,LCC LOGO DOG WASTE ACCEPTED,JET BLACK - RAL 9005,GOOD,NONE,,,MONDAY,0
735,CLAYPIT LANE,ARENA,SHOPS/OFFICES,430078.96,434168.85,LITTLE LONDON & WOODHOUSE,METAL SQUARE,POSTBOX 4 SIDES WITH SELF CLOSING ASHTRAY,500MM X 500MM BALLAST ONLY,120 LITRES,LCC LOGO DOG WASTE ACCEPTED,JET BLACK - RAL 9005,GOOD,NONE,CITY CENTRE MANAGEMENT,,DAILY,0
736,CLOTH HALL STREET,O/S CORN EXCHANGE,SHOPS/OFFICES,430376.74,433369.64,LITTLE LONDON & WOODHOUSE,METAL SQUARE,POSTBOX 4 SIDES WITH SELF CLOSING ASHTRAY,500MM X 500MM BALLAST ONLY,120 LITRES,LCC LOGO DOG WASTE ACCEPTED,JET BLACK - RAL 9005,GOOD,NONE,CITY CENTRE MANAGEMENT,,DAILY,0
765,CLIFFORD ROAD,NR BRING POINT,SHOPS/OFFICES,442676.8,443522.61,WETHERBY,METAL SQUARE,POSTBOX 4 SIDES WITH SELF CLOSING ASHTRAY,500MM X 500MM BALLAST ONLY,120 LITRES,LCC LOGO DOG WASTE ACCEPTED,JET BLACK - RAL 9005,POOR,RUSTY,,,WEEKLY,0