OBJECTID,ROAD_NAME,LOCATION,EASTING,NORTHING,WARD,MODEL,CONDITION,DEFECTS,COMMENTS,LASTUPDATED,FREQUENCY,SEQUENCE,BINID
6,A659, ,438511.85,445926.62,HAREWOOD,,,,,7/12/2011 0:00, ,,6
7,A659, ,438608.6,445962.8,HAREWOOD,,,,,7/12/2011 0:00, ,,7
12,ABBEY ROAD,IN FRONT OF MEMORIAL,426269.49,435634.51,KIRKSTALL,METAL SQUARE,GOOD,NONE,,7/12/2018 0:00,DAILY,,12
41,AIRE STREET, ,429753.16,433355.41,HUNSLET & RIVERSIDE,,,,CITY CENTRE MANAGEMENT,7/12/2011 0:00, ,,41
44,ALANDALE CRESCENT, ,439552.26,432945.94,GARFORTH & SWILLINGTON,,,,,9/12/2018 0:00,WED,,44
52,ALBION STREET, ,430051.72,433668.99,LITTLE LONDON & WOODHOUSE,,,,CITY CENTRE MANAGEMENT,7/12/2011 0:00, ,,52
59,ALBION STREET, ,420732.88,445218.86,OTLEY & YEADON,POST BIN,POOR,NONE,,6/11/2018 0:00,MON,,59
70,ALBION STREET, ,430070.9,433761.14,LITTLE LONDON & WOODHOUSE,,,,CITY CENTRE MANAGEMENT,7/12/2011 0:00, ,,70
73,ALBION STREET, ,430063.33,433874.71,LITTLE LONDON & WOODHOUSE,,,,CITY CENTRE MANAGEMENT,7/12/2011 0:00, ,,73
82,ALEXANDRA ROAD, ,428475.16,434564.81,HYDE PARK & WOODHOUSE,METAL TWIN,POOR,NO LOCK,,6/25/2018 0:00,MON,,82
86,ALWOODLEY LANE, ,431085.22,440738.94,ALWOODLEY,,,,,7/12/2011 0:00, ,,86
110,ASHLEY ROAD, ,432032.67,434887.28,GIPTON & HAREHILLS,,,,,7/12/2018 0:00,MON/THU,,110
114,ASQUITH AVENUE, ,425994.09,428246.48,MORLEY NORTH,,,,,7/12/2011 0:00, ,,114
115,ASQUITH AVENUE, ,425966.28,428271.47,MORLEY NORTH,,,,,7/12/2011 0:00, ,,115
121,AT ANNS LANE, ,427185.05,435292.88,KIRKSTALL,METAL SQUARE,GOOD,NONE,,7/12/2018 0:00,WED/SUN,,121
125,AUSTHORPE ROAD, ,436323,434686,CROSSGATES & WHINMOOR,,,,,7/12/2011 0:00, ,,125
127,AUSTHORPE ROAD, ,436507.71,434687.48,CROSSGATES & WHINMOOR,,,,,7/12/2011 0:00, ,,127
138,AUSTHORPE ROAD, ,436472.75,434689.89,CROSSGATES & WHINMOOR,,,,,7/12/2011 0:00, ,,138
155,BAGLEY LANE, ,422136.49,435616.91,CALVERLEY & FARSLEY,,,,,8/28/2018 0:00,SUN,,155
156,BAGLEY LANE, ,421839.55,435521.93,CALVERLEY & FARSLEY,,,,,8/28/2018 0:00,SUN,,156
161,BAR LANE, ,441139.91,433393.54,GARFORTH & SWILLINGTON,,,,,9/12/2018 0:00,DAILY,,161
167,BAR LANE, ,441110.62,433546.77,GARFORTH & SWILLINGTON,,,,,9/12/2018 0:00,DAILY,,167
184,BARWICK ROAD, ,437228.52,435756.88,CROSSGATES & WHINMOOR,,,,,7/12/2011 0:00, ,,184
191,BATCLIFFE DRIVE, ,427192.02,436527.77,WEETWOOD,,,,,7/12/2011 0:00,DAILY,,191
210,BELL LANE, ,424438.11,435373.42,BRAMLEY & STANNINGLEY,METAL SQUARE,GOOD,NONE,,7/12/2018 0:00,TUE,,210
212,BELLE ISLE CIRCUS, ,431221.42,429852.38,MIDDLETON PARK,METAL SQUARE,GOOD,NONE,,7/12/2018 0:00,MONDAY,,212
244,BENTCLIFFE AVENUE, ,431289.86,438527.67,MOORTOWN,,,,,7/12/2018 0:00,TUE/THU,,244
253,BIRCHWOOD HILL,BUS STOP,432115.26,439411.14,ALWOODLEY,,,,,7/12/2011 0:00, ,,253
265,BOAR LANE, ,430035.56,433366.19,HUNSLET & RIVERSIDE,,,,CITY CENTRE MANAGEMENT,7/12/2011 0:00, ,,265
276,BOGGART HILL DRIVE,O/S POST OFFICE,435012.7,436889.18,KILLINGBECK & SEACROFT,,,,,7/12/2011 0:00, ,,276
277,BOGGART HILL DRIVE,JUNC BARNCROFT RISE,434715.28,436857.37,KILLINGBECK & SEACROFT,,,,,7/12/2011 0:00, ,,277
283,BOND COURT, ,429831.09,433602.98,LITTLE LONDON & WOODHOUSE,,,,CITY CENTRE MANAGEMENT,7/12/2011 0:00, ,,283
291,BONDGATE, ,420280.71,445425.61,OTLEY & YEADON,,,,,6/11/2018 0:00,DAILY,,291
296,BOROUGHGATE, ,420266.08,445560.85,OTLEY & YEADON,,,,,6/11/2018 0:00,DAILY,,296
303,BOSTON ROAD, ,440606.32,447945.75,WETHERBY,,,,,7/12/2011 0:00, ,,303
315,BOSTON ROAD, ,442834.34,445008.82,WETHERBY,,,,,7/12/2011 0:00, ,,315
318,BRACKENWOOD DRIVE, ,431294.29,437431.73,ROUNDHAY,,,,,7/12/2018 0:00,WED/SUN,,318
319,BRACKENWOOD DRIVE, ,431333.65,437398.42,ROUNDHAY,,,,,7/12/2018 0:00,WED/SUN,,319
331,BRADFORD ROAD,O/S PO,419215.98,444914.23,OTLEY & YEADON,PLASTIC ROUND OPEN TOP,POOR,NONE,,6/11/2018 0:00,FRI,,331
349,BRADFORD ROAD, ,429013.64,425960.11,ARDSLEY & ROBIN HOOD,,,,,7/12/2011 0:00, ,,349
362,BRADFORD ROAD, ,419363.98,444976.97,OTLEY & YEADON,METAL SQUARE,GOOD,NONE,,6/11/2018 0:00,FRI,,362
367,BRADFORD ROAD, ,421937.8,434355.78,CALVERLEY & FARSLEY,METAL SQUARE,GOOD,NONE,,8/28/2018 0:00,MON,,367
380,BRANCH END, ,424940.46,429059.28,MORLEY NORTH,,,,,7/12/2011 0:00, ,,380
397,BRIDGE ROAD, ,422069.76,436477.27,CALVERLEY & FARSLEY,PLASTIC POST,FAIR,NONE,,8/28/2018 0:00,SAT,,397
400,BRIDGE STREET, ,420220.28,445706.26,OTLEY & YEADON,METAL SQUARE OPEN TOP,POOR,NONE,,6/11/2018 0:00,DAILY,,400
408,BRIGGATE, ,430260.17,433612.24,LITTLE LONDON & WOODHOUSE,,,,CITY CENTRE MANAGEMENT,7/12/2011 0:00, ,,408
410,BRIGGATE, ,430269.01,433698.05,LITTLE LONDON & WOODHOUSE,,,,CITY CENTRE MANAGEMENT,7/12/2011 0:00, ,,410
430,BROAD LANE, ,423135.9,434919.97,BRAMLEY & STANNINGLEY,METAL SQUARE,GOOD,NONE,,7/12/2018 0:00,TUE/THU,,430
433,BROAD LANE, ,423655.08,435176.99,BRAMLEY & STANNINGLEY,METAL TWIN,POOR,NO LOCK,,7/12/2018 0:00,TUE/THU,,433
440,BROADGATE WALK, ,424467.21,437973.66,HORSFORTH,,,,,7/12/2011 0:00,WEEKLY,,440
446,BROADWAY, ,424046.58,437708.52,HORSFORTH,,,,,7/12/2011 0:00,WEEKLY,,446
449,BROOM ROAD, ,431537.44,429243.67,MIDDLETON PARK,METAL SQUARE,GOOD,NONE,,5/12/2018 0:00,WEDNESDAY,,449
468,BRUDENELL ROAD,JUNC WITH THORNVILLE ROAD O/S FRUIT SHOP,428195.22,435015.72,HEADINGLEY,METAL TWIN,FAIR,NONE,,6/25/2018 0:00,WED,,468
473,BRUNTCLIFFE LANE, ,425120.26,427755.52,MORLEY SOUTH,,,,,7/12/2011 0:00, ,,473
482,BURLEY ROAD, ,427149.31,435267.29,KIRKSTALL,METAL SQUARE,GOOD,NONE,,7/12/2018 0:00,WED/SUN,,482
496,BURMANTOFTS STREET, ,431569.6,434342.88,BURMANTOFTS & RICHMOND HILL,,,,,7/12/2011 0:00, ,,496
508,BUTT LANE,O/S TOILETS & BUS STOP,441535.4,430235.91,KIPPAX & METHLEY,,,,,9/12/2018 0:00,TUE,,508
510,BUTTERBOWL DRIVE, ,425819.59,432217.88,FARNLEY & WORTLEY,,,,,7/12/2011 0:00, ,,510
533,CANAL ROAD, ,422282.75,436421.14,CALVERLEY & FARSLEY,PLASTIC ROUND,FAIR,NONE,,8/28/2018 0:00,SAT,,533
536,CARDIGAN LANE, ,427704.76,434808.64,KIRKSTALL,METAL SQUARE,GOOD,NONE,,7/12/2018 0:00,WED/SUN,,536
538,CARDIGAN ROAD, ,428114.22,434671.21,HYDE PARK & WOODHOUSE,METAL TWIN,FAIR,NONE,,6/25/2018 0:00,MON,,538
544,CARDIGAN ROAD,OPP BAINBRIGG ROAD AT PELICAN CROSSING,427939.83,435698.47,HEADINGLEY,,,,,7/12/2018 0:00,WED,,544
562,CARLTON LANE, ,433296.15,426220.68,ARDSLEY & ROBIN HOOD,,,,,7/12/2011 0:00, ,,562
563,CARLTON LANE, ,434244.92,427827.51,ROTHWELL,,,,,7/12/2011 0:00, ,,563
572,CARR MANOR PARADE, ,429963.2,437677.41,MOORTOWN,,,,,7/12/2018 0:00,MON/FRI,,572
581,CARRHOLM ROAD, ,429745.51,437071.66,MOORTOWN,,,,,7/12/2018 0:00,MON/FRI,,581
583,CARTMELL DRIVE, ,433992.82,433209.94,TEMPLE NEWSAM,,,,,7/12/2011 0:00, ,,583
594,CEMETERY ROAD, ,429345.25,431413.04,BEESTON & HOLBECK,,,,,7/12/2011 0:00, ,,594
596,CEMETERY ROAD, ,429167.29,431606.11,BEESTON & HOLBECK,,,,,7/12/2011 0:00, ,,596
601,CHANDOS GARDENS, ,431659.15,437681.53,ROUNDHAY,,,,,7/12/2018 0:00,WED/SUN,,601
602,CHANDOS GARDENS, ,431624.33,437660.33,ROUNDHAY,,,,,7/12/2018 0:00,WED/SUN,,602
616,CHAPELTOWN, ,421735.65,432942.86,PUDSEY,,,,,8/28/2018 0:00,FRI,,616
624,CHAPELTOWN ROAD, ,430965.87,435812.05,CHAPEL ALLERTON,,,,,7/12/2018 0:00,MON/THU,,624
632,CHURCH CAUSEWAY, ,443359.29,445945.21,WETHERBY,,,,,7/12/2011 0:00, ,,632
646,CHURCH LANE, ,440474.33,433036.78,GARFORTH & SWILLINGTON,,,,,9/12/2018 0:00,WED,,646
653,CHURCH LANE, ,422281.01,433414.86,PUDSEY,,,,,8/28/2018 0:00,DAILY,,653
656,CHURCH LANE, ,422119.61,433203.2,PUDSEY,,,,,8/28/2018 0:00,DAILY,,656
664,CHURCH LANE, ,441065.56,433129.91,GARFORTH & SWILLINGTON,,,,,9/12/2018 0:00,WED,,664
667,CHURCH LANE, ,430771.98,437041.13,CHAPEL ALLERTON,,,,,7/12/2018 0:00,WED/SAT,,667
671,CHURCH STREET,HUNSLET,431194.59,431487.81,HUNSLET & RIVERSIDE,METAL SQUARE,GOOD,NONE,,9/12/2018 0:00,DAILY,,671
690,CHURCHFIELD ROAD, ,434446.84,428446.1,ROTHWELL,,,,,7/12/2011 0:00, ,,690
711,CLARENDON ROAD, ,429219.95,434970.8,HYDE PARK & WOODHOUSE,METAL TWIN,POOR,NO LOCK,,6/25/2018 0:00,MON,,711
712,CLAYPIT LANE, ,445569.15,429756.2,KIPPAX & METHLEY,,,,,9/12/2018 0:00,THU,,712
716,CLIFFORD MOOR ROAD, ,442539.95,444503.39,WETHERBY,,,,,7/12/2011 0:00, ,,716
736,COCKSHOTT LANE, ,425976.09,434684.81,ARMLEY,METAL SQUARE,GOOD,NONE,,8/12/2018 0:00,MON/THU,,736
765,COMMERCIAL STREET, ,426539.65,427740.27,MORLEY SOUTH,,,,,7/12/2011 0:00, ,,765
773,CONSTABLE ROAD, ,428461.6,425672.95,ARDSLEY & ROBIN HOOD,,,,,7/12/2011 0:00, ,,773
796,COTE LANE, ,421050.57,435049.6,CALVERLEY & FARSLEY,,,,,8/28/2018 0:00,MON,,796
802,COTE LANE, ,421099.35,434758.75,CALVERLEY & FARSLEY,METAL SQUARE,GOOD,NONE,,8/28/2018 0:00,MON,,802
805,COTTINGLEY DRIVE, ,427325.99,430269.91,BEESTON & HOLBECK,,,,,7/12/2011 0:00, ,,805
807,COTTINGLEY VALE, ,427605.98,430348.36,BEESTON & HOLBECK,,,,,7/12/2011 0:00, ,,807
812,COWPER STREET, ,431088.68,435502.23,CHAPEL ALLERTON,,,,,7/12/2018 0:00,MON/THU,,812
813,CRAB LANE, ,427296.87,433576.24,ARMLEY,METAL TWIN,GOOD,NONE,,8/12/2018 0:00,DAILY,,813
825,CRAMNER BANK,OUTSIDE SHOPS,429182.35,439119.77,ALWOODLEY,,,,,7/12/2011 0:00, ,,825
832,CROMWELL STREET, ,431149.74,434279.88,BURMANTOFTS & RICHMOND HILL,,,,,7/12/2011 0:00, ,,832
850,CROSSGATES ROAD, ,435699,434784.28,KILLINGBECK & SEACROFT,,,,,7/12/2011 0:00, ,,850
861,CUMBERLAND ROAD, ,428769.33,435759.18,HEADINGLEY,METAL SQUARE,GOOD,NONE,,6/25/2018 0:00,TUE,,861
869,DEIGHTON ROAD, ,440245.08,449623.85,WETHERBY,,,,,7/12/2011 0:00, ,,869
889,DEWSBURY ROAD, ,430101.53,431707.72,HUNSLET & RIVERSIDE,METAL SQUARE,GOOD,NONE,,7/12/2018 0:00,DAILY,,889
913,DIXON LANE, ,427161.39,432503.92,FARNLEY & WORTLEY,,,,,7/12/2011 0:00, ,,913
916,DIXON LANE, ,427309.02,432020.14,FARNLEY & WORTLEY,,,,,7/12/2011 0:00, ,,916
918,DIXON LANE ROAD, ,427018.2,432312.24,FARNLEY & WORTLEY,,,,,7/12/2011 0:00, ,,918
929,DORTMUND SQUARE, ,430147.87,433797.73,LITTLE LONDON & WOODHOUSE,,,,CITY CENTRE MANAGEMENT,7/12/2011 0:00, ,,929
935,DULVERTON GREEN, ,427696.6,430127.02,BEESTON & HOLBECK,,,,,7/12/2011 0:00, ,,935
938,DUNCAN STREET, ,430300.29,433404.78,LITTLE LONDON & WOODHOUSE,,,,CITY CENTRE MANAGEMENT,7/12/2011 0:00, ,,938
942,DUNHILL RISE, ,434252.99,433969.54,TEMPLE NEWSAM,,,,,7/12/2011 0:00, ,,942
951,EASTERLY ROAD, ,432797.73,435972.01,ROUNDHAY,,,,,7/12/2018 0:00,MON/THU,,951
971,EASTGATE, ,430378.01,433737.07,LITTLE LONDON & WOODHOUSE,,,,CITY CENTRE MANAGEMENT,7/12/2011 0:00, ,,971
973,EASTGATE, ,430273.23,433730.29,LITTLE LONDON & WOODHOUSE,,,,CITY CENTRE MANAGEMENT,7/12/2011 0:00, ,,973
983,EASTGATE, ,430517.59,433694.26,LITTLE LONDON & WOODHOUSE,,,,CITY CENTRE MANAGEMENT,7/12/2011 0:00, ,,983
985,EASTGATE, ,430602.13,433682.91,LITTLE LONDON & WOODHOUSE,,,,CITY CENTRE MANAGEMENT,7/12/2011 0:00, ,,985
990,EASTGATE, ,430426.74,433728.33,LITTLE LONDON & WOODHOUSE,,,,CITY CENTRE MANAGEMENT,7/12/2011 0:00, ,,990
991,EASTGATE, ,430401.5,433734.64,LITTLE LONDON & WOODHOUSE,,,,CITY CENTRE MANAGEMENT,7/12/2011 0:00, ,,991
999,ELLAND ROAD, ,427269.43,429598.49,MORLEY NORTH,,,,,7/12/2011 0:00, ,,999
1018,FAIRBURN DRIVE, ,441192.87,432346.9,GARFORTH & SWILLINGTON,,,,,9/12/2018 0:00,WED,,1018
1030,FALL LANE, ,430944.41,425846.04,ARDSLEY & ROBIN HOOD,,,,,7/12/2011 0:00, ,,1030
1037,FARRAR LANE, ,426258.76,439944.24,ADEL & WHARFEDALE,METAL SQUARE,GOOD,NONE,,6/11/2018 0:00,WED/SAT,,1037
1042,FEATHERBANK LANE, ,423694.12,437532.06,HORSFORTH,,,,,7/12/2011 0:00,WEEKLY,,1042
1065,FOUNTAIN STREET, ,425839.25,427239.97,MORLEY SOUTH,,,,,7/12/2011 0:00, ,,1065
1071,FRASER STREET, ,431766.87,434208.1,BURMANTOFTS & RICHMOND HILL,,,,,7/12/2011 0:00, ,,1071
1077,FRONT STREET, ,442449.52,443003.78,WETHERBY,,,,,7/12/2011 0:00, ,,1077
1079,GALLOWAY LANE, ,420513.59,433925.51,CALVERLEY & FARSLEY,,,,,8/28/2018 0:00,TUE,,1079
1090,GIBSON LANE, ,442011.61,430443.59,KIPPAX & METHLEY,,,,,9/12/2018 0:00,TUE,,1090
1092,GIPSY LANE, ,429131.71,429408.3,BEESTON & HOLBECK,,,,,7/12/2011 0:00, ,,1092
1120,GLEDHOW LANE, ,432540.26,437198.58,ROUNDHAY,,,,,7/12/2018 0:00,WED/SUN,,1120
1127,GLEDHOW PARK DRIVE, ,431405.06,436810.66,CHAPEL ALLERTON,,,,,7/12/2018 0:00,WED/SAT,,1127
1135,GREAT GEORGE STREET, ,429410.75,434004.89,LITTLE LONDON & WOODHOUSE,,,,CITY CENTRE MANAGEMENT,7/12/2011 0:00, ,,1135
1140,GREAT GEORGE STREET, ,429756.26,433911.84,LITTLE LONDON & WOODHOUSE,,,,CITY CENTRE MANAGEMENT,7/12/2011 0:00, ,,1140
1150,GREAT NORTH ROAD, ,444440.5,432619.41,KIPPAX & METHLEY,,,,,9/12/2018 0:00,THU,,1150
1166,GREEN LANE, ,428057.09,433178.62,ARMLEY,METAL SQUARE,GOOD,NONE,,8/12/2018 0:00,MON/THU,,1166
1188,GROSVENOR ROAD, ,428865.17,435829.4,HEADINGLEY,METAL SQUARE,GOOD,NONE,,6/25/2018 0:00,TUE,,1188
1195,GROVE ROAD, ,434040.86,433354.22,TEMPLE NEWSAM,,,,,7/12/2011 0:00, ,,1195
1204,HAIGH ROAD, ,434576.97,428884.6,ROTHWELL,,,,,7/12/2011 0:00, ,,1204
1216,HALL LANE, ,427756.77,433375.42,ARMLEY,METAL TWIN,FAIR,NONE,,8/12/2018 0:00,MON/THU,,1216
1222,HALLFIELD LANE, ,440783.97,448241.48,WETHERBY,,,,,7/12/2011 0:00, ,,1222
1224,HALLFIELD LANE, ,440923.42,448589.83,WETHERBY,,,,,7/12/2011 0:00, ,,1224
1227,HALLFIELD LANE, ,440948.56,448408.47,WETHERBY,,,,,7/12/2011 0:00, ,,1227
1246,HAREHILLS AVENUE, ,431904.25,435895.65,GIPTON & HAREHILLS,,,,,7/12/2018 0:00,MON/THU,,1246
1248,HAREHILLS LANE, ,431892.55,435912.52,GIPTON & HAREHILLS,,,,,7/12/2018 0:00,MON/THU,,1248
1284,HAREHILLS LANE, ,430930.94,436555.16,CHAPEL ALLERTON,,,,,7/12/2018 0:00,WED/SAT,,1284
1293,HAREHILLS LANE, ,432207.84,435185.66,GIPTON & HAREHILLS,,,,,7/12/2018 0:00,DAILY,,1293
1294,HAREHILLS LANE, ,432225.78,435120.8,GIPTON & HAREHILLS,,,,,7/12/2018 0:00,DAILY,,1294
1316,HARROGATE ROAD, ,430790.88,438656.15,MOORTOWN,,,,,7/12/2018 0:00,DAILY,,1316
1317,HARROGATE ROAD, ,430768.68,438716.83,MOORTOWN,,,,,7/12/2018 0:00,DAILY,,1317
1325,HARROGATE ROAD, ,430457.89,438095.25,MOORTOWN,,,,,7/12/2018 0:00,TUE/THU,,1325
1345,HARROGATE ROAD, ,430704.62,439095.57,MOORTOWN,,,,,7/12/2018 0:00,DAILY,,1345
1351,HARROGATE ROAD, ,430788.63,438667.1,MOORTOWN,,,,,7/12/2018 0:00,DAILY,,1351
1353,HARROGATE ROAD, ,430794.69,438620.17,MOORTOWN,,,,,7/12/2018 0:00,DAILY,,1353
1355,HARROGATE ROAD, ,430784.09,438550.53,MOORTOWN,,,,,7/12/2018 0:00,DAILY,,1355
1356,HARROGATE ROAD, ,430743.21,438308.27,MOORTOWN,,,,,7/12/2018 0:00,TUE/THU,,1356
1361,HARROGATE ROAD, ,430576.68,438137.22,MOORTOWN,,,,,7/12/2018 0:00,DAILY,,1361
1364,HARROGATE ROAD, ,430805.28,436649.02,CHAPEL ALLERTON,,,,,7/12/2018 0:00,WED/SAT,,1364
1379,HARROGATE ROAD, ,430481.3,437118.34,CHAPEL ALLERTON,,,,,7/12/2018 0:00,DAILY,,1379
1380,HARROGATE ROAD, ,430496.44,437145.59,CHAPEL ALLERTON,,,,,7/12/2018 0:00,DAILY,,1380
1381,HARROGATE ROAD, ,430470.7,437322.72,CHAPEL ALLERTON,,,,,7/12/2018 0:00,WED/SAT,,1381
1390,HARTHILL PARADE, ,424813.76,429168.56,MORLEY NORTH,,,,,7/12/2011 0:00, ,,1390
1413,HEIGHTS DRIVE, ,425367.46,433388.01,FARNLEY & WORTLEY,,,,,7/12/2011 0:00, ,,1413
1434,HIGH ASH DRIVE, ,431565.73,440082.07,ALWOODLEY,,,,,7/12/2011 0:00, ,,1434
1448,HIGH STREET, ,442791.1,445757.22,WETHERBY,,,,,7/12/2011 0:00, ,,1448
1455,HIGH STREET, ,442999.27,445643.72,WETHERBY,,,,,7/12/2011 0:00, ,,1455
1467,HIGH STREET, ,441781.22,430218.27,KIPPAX & METHLEY,,,,,9/12/2018 0:00,TUE,,1467
1472,HIGH STREET, ,441635.32,430231.22,KIPPAX & METHLEY,,,,,9/12/2018 0:00,TUE,,1472
1485,HOLMEFIELD DRIVE, ,432846.78,427631.53,ARDSLEY & ROBIN HOOD,,,,,7/12/2011 0:00, ,,1485
1496,HOLMSLEY LANE, ,436206.63,429091.47,ROTHWELL,,,,,7/12/2011 0:00, ,,1496
1509,HOLTDALE APPROACH, ,425799.79,439956.71,ADEL & WHARFEDALE,METAL SQUARE,GOOD,NONE,,6/11/2018 0:00,WED/SAT,,1509
1523,INFIRMARY STREET, ,429828.47,433572.85,LITTLE LONDON & WOODHOUSE,,,,CITY CENTRE MANAGEMENT,7/12/2011 0:00, ,,1523
1536,INGRAM ROAD, ,428785.45,431878.15,BEESTON & HOLBECK,,,,,7/12/2011 0:00, ,,1536
1539,IRONWOOD APPROACH, ,435089.01,435209.53,KILLINGBECK & SEACROFT,,,,,7/12/2011 0:00, ,,1539
1545,TOWN HALL SQUARE, ,420807.63,441128.95,OTLEY & YEADON,METAL SQUARE,GOOD,NONE,,6/11/2018 0:00,DAILY,,1545
1549,IVESON APPROACH, ,425858.72,438728.4,WEETWOOD,,,,,7/12/2011 0:00,DAILY,,1549
1550,IVESON APPROACH, ,425843.23,438705.87,WEETWOOD,,,,,7/12/2011 0:00,DAILY,,1550
1552,IVESON DRIVE, ,425886.88,439101.6,WEETWOOD,,,,,7/12/2011 0:00,DAILY,,1552
1564,JACKSON AVENUE, ,431922.57,437430.21,ROUNDHAY,,,,,7/12/2018 0:00,WED/SUN,,1564
1569,KENT ROAD, ,422830.51,433435.67,PUDSEY,PLASTIC ROUND,FAIR,NONE,,8/28/2018 0:00,WED,,1569
1587,KING LANE, ,429916.23,438753.83,MOORTOWN,,,,,7/12/2018 0:00,TUE/THU,,1587
1597,KING LANE, ,430475.24,437792.05,MOORTOWN,,,,,7/12/2018 0:00,TUE/THU,,1597
1602,KING LANE,BUS STOP O/S SHOPS,428814.29,440179.2,ALWOODLEY,,,,,7/12/2011 0:00, ,,1602
1605,KING LANE, ,428852.63,440103.8,ALWOODLEY,,,,,7/12/2011 0:00, ,,1605
1606,KING LANE,O/S POST OFFICE,428855.19,440092.29,ALWOODLEY,,,,,7/12/2011 0:00, ,,1606
1623,KINGS CLOSE,O/S OTLEY & ALL SATINTS SCHOOL,421012.88,445268.4,OTLEY & YEADON,METAL TWIN,FAIR,NONE,,6/11/2018 0:00,MON,,1623
1636,KIRKGATE, ,430636.19,433346.6,HUNSLET & RIVERSIDE,,,,CITY CENTRE MANAGEMENT,7/12/2011 0:00, ,,1636
1640,KIRKGATE, ,430424.75,433468.34,LITTLE LONDON & WOODHOUSE,,,,CITY CENTRE MANAGEMENT,7/12/2011 0:00, ,,1640
1646,KIRKGATE, ,430313.59,433526.01,LITTLE LONDON & WOODHOUSE,,,,CITY CENTRE MANAGEMENT,7/12/2011 0:00, ,,1646
1647,KIRKGATE, ,430270.97,433530.53,LITTLE LONDON & WOODHOUSE,,,,CITY CENTRE MANAGEMENT,7/12/2011 0:00, ,,1647
1672,KIRKSTALL ROAD, ,427299.62,434704.2,KIRKSTALL,METAL SQUARE,GOOD,NONE,,7/12/2018 0:00,DAILY,,1672
1694,LANDS LANE, ,430179.81,433714.08,LITTLE LONDON & WOODHOUSE,,,,CITY CENTRE MANAGEMENT,7/12/2011 0:00, ,,1694
1697,LANDS LANE, ,430166.8,433623.6,LITTLE LONDON & WOODHOUSE,,,,CITY CENTRE MANAGEMENT,7/12/2011 0:00, ,,1697
1703,LANGBAR ROAD, ,436778.04,436445.53,CROSSGATES & WHINMOOR,,,,,7/12/2011 0:00, ,,1703
1708,LAWNS LANE, ,424904.7,431840.96,FARNLEY & WORTLEY,,,,,7/12/2011 0:00, ,,1708
1733,LEEDS ROAD,O/S GENERAL STORE,440728.42,428669.58,KIPPAX & METHLEY,,,,,9/12/2018 0:00,SAT,,1733
1761,LEEDS ROAD, ,439961.67,437064.85,HAREWOOD,,,,,7/12/2011 0:00, ,,1761
1779,LEEDS ROAD, ,441668.4,427982.45,KIPPAX & METHLEY,,,,,9/12/2018 0:00,SAT,,1779
1781,LEEDS ROAD, ,441702.67,427911.81,KIPPAX & METHLEY,,,,,9/12/2018 0:00,SAT,,1781
1798,LEEDS ROAD,O/S OPTICIANS,425827.45,442858.6,ADEL & WHARFEDALE,METAL SQUARE,GOOD,NONE,,6/11/2018 0:00,TUE/THU,,1798
1802,LEEDS ROAD, ,419360.85,441703.88,GUISELEY & RAWDON,METAL SQUARE,GOOD,NONE,,7/12/2018 0:00,TWICE WEEKLY,,1802
1805,LEEDS ROAD, ,434981,428988.73,ROTHWELL,,,,,7/12/2011 0:00, ,,1805
1815,LIDGETT HILL, ,422331.28,433409.57,PUDSEY,,,,,8/28/2018 0:00,DAILY,,1815
1816,LIDGETT HILL, ,422328.63,433398.99,PUDSEY,,,,,8/28/2018 0:00,DAILY,,1816
1823,LIDGETT LANE, ,430807.16,438432.68,MOORTOWN,,,,,7/12/2018 0:00,TUE/THU,,1823
1859,LINCOLN GREEN ROAD, ,431151.71,434221.77,BURMANTOFTS & RICHMOND HILL,,,,,7/12/2011 0:00, ,,1859
1867,LINCOLN GREEN ROAD, ,431362.69,434114.53,BURMANTOFTS & RICHMOND HILL,,,,,7/12/2011 0:00, ,,1867
1869,LINCOMBE DRIVE, ,431061.71,437728.22,ROUNDHAY,,,,,7/12/2018 0:00,WED/SUN,,1869
1873,LINDSEY ROAD, ,431328.95,434194.47,BURMANTOFTS & RICHMOND HILL,,,,,7/12/2011 0:00, ,,1873
1875,LINGFIELD DRIVE, ,430492,439290.89,ALWOODLEY,,,,,7/12/2011 0:00, ,,1875
1900,LONG CAUSEWAY, ,427726.05,439012.44,ADEL & WHARFEDALE,,,,,6/11/2018 0:00,MON/FRI,,1900
1903,LONG CAUSEWAY, ,427710.96,438917.41,ADEL & WHARFEDALE,,,,,6/11/2018 0:00,MON/FRI,,1903
1912,LOW FIELDS ROAD, ,428410.78,431402.03,BEESTON & HOLBECK,,,,,7/12/2011 0:00, ,,1912
1922,LOW LANE, ,424647.68,438458.15,HORSFORTH,,,,,7/12/2011 0:00,WEEKLY,,1922
1925,LOW MOOR SIDE, ,424735.47,431140.07,FARNLEY & WORTLEY,,,,,7/12/2011 0:00, ,,1925
1935,LOWER WORTLEY ROAD, ,426823.97,432165.06,FARNLEY & WORTLEY,,,,,7/12/2011 0:00, ,,1935
1945,LOWER WORTLEY ROAD, ,427033.06,432411.93,FARNLEY & WORTLEY,,,,,7/12/2011 0:00, ,,1945
1948,LOWRY ROAD, ,428507.38,425795.05,ARDSLEY & ROBIN HOOD,,,,,7/12/2011 0:00, ,,1948
1959,LOWTOWN, ,422453.51,433234.09,PUDSEY,,,,,8/28/2018 0:00,DAILY,,1959
1963,LUPTON AVENUE,JUNC WITH NOWELL LANE,432560.73,434330.64,BURMANTOFTS & RICHMOND HILL,,,,,7/12/2011 0:00, ,,1963
1969,MAIN STREET, ,443317.52,436861.81,HAREWOOD,,,,,7/12/2011 0:00, ,,1969
1975,MAIN STREET,HAWKSWORTH,416815.5,441683.01,GUISELEY & RAWDON,METAL SQUARE,GOOD,NONE,,7/10/2018 0:00,WEEKLY,,1975
1982,MAIN STREET, ,437956.52,436449.07,HAREWOOD,,,,,7/12/2011 0:00, ,,1982
1990,MAIN STREET, ,439954.34,437432.86,HAREWOOD,,,,,7/12/2011 0:00, ,,1990
2002,MAIN STREET, ,430907.8,425701.69,ARDSLEY & ROBIN HOOD,,,,,7/12/2011 0:00, ,,2002
2005,MAIN STREET, ,430664.16,425483.41,ARDSLEY & ROBIN HOOD,,,,,7/12/2011 0:00, ,,2005
2015,MAIN STREET, ,424428.63,445239.23,ADEL & WHARFEDALE,PLASTIC ROUND OPEN TOP,POOR,NO LINER,,6/11/2018 0:00,MON/TUE/WED/THU/FRI/SAT,,2015
2057,MARSH STREET CAR PARK, ,434486.26,428073.56,ROTHWELL,,,,,7/12/2011 0:00, ,,2057
2062,MARSHALL STREET, ,420984.1,441177.33,OTLEY & YEADON,METAL SQUARE,GOOD,NONE,,6/11/2018 0:00,DAILY,,2062
2067,MAYNELL AVENUE, ,434473.58,428156.37,ROTHWELL,,,,,7/12/2011 0:00, ,,2067
2082,MEANWOOD ROAD, ,430160.29,435120.76,HYDE PARK & WOODHOUSE,,,,,7/12/2018 0:00,SUN,,2082
2092,MERCURY ROW, ,420264.32,445516.77,OTLEY & YEADON,,,,,6/11/2018 0:00,DAILY,,2092
2093,MERRION WAY, ,430102.87,434147.52,LITTLE LONDON & WOODHOUSE,,,,CITY CENTRE MANAGEMENT,7/12/2011 0:00, ,,2093
2102,MEYNELL AVENUE, ,434390.71,428472.51,ROTHWELL,,,,,7/12/2011 0:00, ,,2102
2104,MEYNELL AVENUE, ,434396.21,428406.47,ROTHWELL,,,,,7/12/2011 0:00, ,,2104
2106,MIDDLETON LANE, ,430956.03,427041.42,ARDSLEY & ROBIN HOOD,,,,,7/12/2011 0:00, ,,2106
2113,MIDDLETON PARK AVENUE, ,429921.33,427441.12,MIDDLETON PARK,METAL SQUARE,GOOD,NONE,,7/12/2018 0:00,TUESDAY,,2113
2137,MIDDLETON PARK ROAD, ,429878.51,428020.81,MIDDLETON PARK,METAL SQUARE,GOOD,NONE,,7/12/2018 0:00,DAILY,,2137
2142,MIDDLETON PARK ROAD, ,429910.01,428160.33,MIDDLETON PARK,METAL SQUARE,GOOD,NONE,,7/12/2018 0:00,THURSDAY,,2142
2148,MIDDLETON ROAD, ,431460.14,430360.99,MIDDLETON PARK,METAL TWIN,FAIR,NO LOCK,,7/12/2018 0:00,MONDAY,,2148
2153,MIDDLETON ROAD, ,431450.72,429447.55,MIDDLETON PARK,METAL SQUARE,GOOD,NONE,,7/12/2018 0:00,WEDNESDAY,,2153
2189,MOORLAND ROAD, ,428936.95,434773.94,HYDE PARK & WOODHOUSE,METAL SQUARE,GOOD,NONE,,6/25/2018 0:00,MON,,2189
2209,NASEBY VIEW, ,431174.94,433932.72,BURMANTOFTS & RICHMOND HILL,,,,,7/12/2011 0:00, ,,2209
2215,NEVILLE ROAD, ,433866.91,433468.01,TEMPLE NEWSAM,,,,,7/12/2011 0:00, ,,2215
2229,NEW BRIGGATE, ,430333.26,433939.37,LITTLE LONDON & WOODHOUSE,,,,CITY CENTRE MANAGEMENT,7/12/2011 0:00, ,,2229
2233,NEW BRIGGATE, ,430269.01,433793.95,LITTLE LONDON & WOODHOUSE,,,,CITY CENTRE MANAGEMENT,7/12/2011 0:00, ,,2233
2235,NEW BRIGGATE, ,430299.29,433859.57,LITTLE LONDON & WOODHOUSE,,,,CITY CENTRE MANAGEMENT,7/12/2011 0:00, ,,2235
2239,NEW BRIGGATE, ,430323.26,433860.83,LITTLE LONDON & WOODHOUSE,,,,CITY CENTRE MANAGEMENT,7/12/2011 0:00, ,,2239
2240,NEW BRIGGATE, ,430337.14,433886.06,LITTLE LONDON & WOODHOUSE,,,,CITY CENTRE MANAGEMENT,7/12/2011 0:00, ,,2240
2256,NEW ROAD SIDE, ,424406.13,437142.12,HORSFORTH,,,,,7/12/2011 0:00,WEEKLY,,2256
2258,NEW ROAD SIDE, ,424113.21,437267.06,HORSFORTH,,,,,7/12/2011 0:00,WEEKLY,,2258
2270,NEW STATION STREET, ,429917.55,433405.16,HUNSLET & RIVERSIDE,,,,CITY CENTRE MANAGEMENT,7/12/2011 0:00, ,,2270
2277,NEW YORK STREET, ,430547.09,433448.35,LITTLE LONDON & WOODHOUSE,,,,CITY CENTRE MANAGEMENT,7/12/2011 0:00, ,,2277
2280,NEW YORK STREET, ,430538.15,433458.95,LITTLE LONDON & WOODHOUSE,,,,CITY CENTRE MANAGEMENT,7/12/2011 0:00, ,,2280
2311,NORTH LANE, ,433847.63,436539.77,ROUNDHAY,,,,,7/12/2018 0:00,MON/THU,,2311
2328,NORTH LANE, ,427654.7,435982.94,HEADINGLEY,METAL TWIN,POOR,NO LOCK,,6/25/2018 0:00,SAT,,2328
2340,NORTH STREET, ,440914.45,448717.32,WETHERBY,,,,,7/12/2011 0:00, ,,2340
2343,NORTHHOLME AVENUE, ,426611.49,437355.03,WEETWOOD,,,,,7/12/2011 0:00,DAILY,,2343
2369,OATLAND DRIVE, ,430353.13,434727.8,HYDE PARK & WOODHOUSE,METAL SQUARE,GOOD,NONE,,7/12/2018 0:00,SUN,,2369
2374,OLD LANE, ,428748.93,430806.89,BEESTON & HOLBECK,,,,,7/12/2011 0:00, ,,2374