OBJECTID,ROAD_NAME,LOCATION,LOCATIONGROUP,EASTING,NORTHING,WARD,MODEL,APERTURE,FIXINGS,LINER,SIGNAGE,MAINCOLOUR,CONDITION,DEFECTS,ROUTE,COMMENTS,LASTUPDATED,FREQUENCY,SEQUENCE,MON,TUE,WED,THU,FRI,SAT,SUN
1972,LIMEWOOD APPROACH,BOTTOM OF RD,GENERAL PATH - HIGH FOOT FALL,435234.38,437126.9,KILLINGBECK & SEACROFT,METAL SQUARE,POSTBOX 4 SIDES WITH SELF CLOSING ASHTRAY,500MM X 500MM BALLAST ONLY,120 LITRES,LCC LOGO DOG WASTE ACCEPTED,JET BLACK - RAL 9005,FAIR,FADED PAINT,,,12/05/2018 00:00,MON,0,,,,,,,
1973,LINCOLN GREEN ROAD,AT BUS SHELTER,BUS STOP OR SHELTER,431204.96,434152.84,BURMANTOFTS & RICHMOND HILL,METAL SQUARE,POSTBOX 4 SIDES WITH SELF CLOSING ASHTRAY,500MM X 500MM BALLAST ONLY,120 LITRES,LCC LOGO DOG WASTE ACCEPTED,JET BLACK - RAL 9005,GOOD,NONE, ,,12/07/2011 00:00,MON,0,,,,,,,
1974,LINCOLN GREEN ROAD,,GENERAL PATH - HIGH FOOT FALL,431422.53,434331.87,BURMANTOFTS & RICHMOND HILL,METAL SQUARE,POSTBOX 4 SIDES WITH SELF CLOSING ASHTRAY,500MM X 500MM BALLAST ONLY,120 LITRES,LCC LOGO DOG WASTE ACCEPTED,JET BLACK - RAL 9005,GOOD,NONE, ,,12/07/2011 00:00,MON,0,,,,,,,
1975,LINCOLN GREEN ROAD,,GENERAL PATH - HIGH FOOT FALL,431260.05,434325.01,BURMANTOFTS & RICHMOND HILL,METAL SQUARE,POSTBOX 4 SIDES WITH SELF CLOSING ASHTRAY,500MM X 500MM BALLAST ONLY,120 LITRES,LCC LOGO DOG WASTE ACCEPTED,JET BLACK - RAL 9005,GOOD,NONE, ,,12/07/2011 00:00,MON,0,,,,,,,
1976,LINCOLN GREEN ROAD,,GENERAL PATH - HIGH FOOT FALL,431089.6109,434221.6729,LITTLE LONDON & WOODHOUSE,METAL SQUARE,POSTBOX 4 SIDES WITH SELF CLOSING ASHTRAY,500MM X 500MM BALLAST ONLY,120 LITRES,LCC LOGO DOG WASTE ACCEPTED,JET BLACK - RAL 9005,GOOD,NONE, ,,12/07/2011 00:00,MON,0,,,,,,,
1977,LINCOLN GREEN ROAD,,GENERAL PATH - HIGH FOOT FALL,431126.8675,434280.9488,LITTLE LONDON & WOODHOUSE,METAL SQUARE,POSTBOX 4 SIDES WITH SELF CLOSING ASHTRAY,500MM X 500MM BALLAST ONLY,120 LITRES,LCC LOGO DOG WASTE ACCEPTED,JET BLACK - RAL 9005,GOOD,NONE, ,,12/07/2011 00:00,MON,0,,,,,,,
1978,LINCOLN GREEN ROAD,,GENERAL PATH - HIGH FOOT FALL,431371.39,434342.59,BURMANTOFTS & RICHMOND HILL,METAL SQUARE,POSTBOX 4 SIDES WITH SELF CLOSING ASHTRAY,500MM X 500MM BALLAST ONLY,120 LITRES,LCC LOGO DOG WASTE ACCEPTED,JET BLACK - RAL 9005,GOOD,NONE, ,,12/07/2011 00:00,MON,0,,,,,,,
1979,LINCOLN GREEN ROAD,,GENERAL PATH - HIGH FOOT FALL,431308.7979,434107.1424,BURMANTOFTS & RICHMOND HILL,METAL SQUARE,POSTBOX 4 SIDES WITH SELF CLOSING ASHTRAY,500MM X 500MM BALLAST ONLY,120 LITRES,LCC LOGO DOG WASTE ACCEPTED,JET BLACK - RAL 9005,GOOD,NONE,,,12/07/2011 00:00,MON,0,,,,,,,
1980,LINCOLN GREEN ROAD,,GENERAL PATH - HIGH FOOT FALL,431151.4454,434224.4158,BURMANTOFTS & RICHMOND HILL,METAL SQUARE,POSTBOX 4 SIDES WITH SELF CLOSING ASHTRAY,500MM X 500MM BALLAST ONLY,120 LITRES,LCC LOGO DOG WASTE ACCEPTED,JET BLACK - RAL 9005,GOOD,NONE, ,,12/07/2011 00:00,MON,0,,,,,,,
1981,LINCOLN GREEN ROAD,,GENERAL PATH - HIGH FOOT FALL,431308.06,434277.91,BURMANTOFTS & RICHMOND HILL,METAL SQUARE,POSTBOX 4 SIDES WITH SELF CLOSING ASHTRAY,500MM X 500MM BALLAST ONLY,120 LITRES,LCC LOGO DOG WASTE ACCEPTED,JET BLACK - RAL 9005,GOOD,NONE, ,,12/07/2011 00:00,MON,0,,,,,,,
1983,LINCOLN GREEN ROAD,,GENERAL PATH - HIGH FOOT FALL,431362.69,434114.53,BURMANTOFTS & RICHMOND HILL,METAL SQUARE,POSTBOX 4 SIDES WITH SELF CLOSING ASHTRAY,500MM X 500MM BALLAST ONLY,120 LITRES,LCC LOGO DOG WASTE ACCEPTED,JET BLACK - RAL 9005,GOOD,NONE,,,12/07/2011 00:00,MON,0,,,,,,,
1985,LINCOLN GREEN ROAD,,GENERAL PATH - HIGH FOOT FALL,431293.7014,434112.6144,BURMANTOFTS & RICHMOND HILL,METAL SQUARE,POSTBOX 4 SIDES WITH SELF CLOSING ASHTRAY,500MM X 500MM BALLAST ONLY,120 LITRES,LCC LOGO DOG WASTE ACCEPTED,JET BLACK - RAL 9005,GOOD,NONE,,,12/07/2011 00:00,MON,0,,,,,,,
2224,MEANWOOD ROAD,O/S LAZY DAISY,SHOPS/OFFICES,430202.9888,435167.7746,LITTLE LONDON & WOODHOUSE,METAL SQUARE,POSTBOX 4 SIDES WITH SELF CLOSING ASHTRAY,500MM X 500MM BALLAST ONLY,120 LITRES,LCC LOGO DOG WASTE ACCEPTED,JET BLACK - RAL 9005,GOOD,NONE,HHH,,22/09/2020 00:00,SUN,0,,,,,,,
2225,MEANWOOD ROAD,,GENERAL PATH - HIGH FOOT FALL,430079.6214,435162.917,LITTLE LONDON & WOODHOUSE,METAL SQUARE,POSTBOX 4 SIDES WITH SELF CLOSING ASHTRAY,500MM X 500MM BALLAST ONLY,120 LITRES,LCC LOGO DOG WASTE ACCEPTED,JET BLACK - RAL 9005,GOOD,NONE,HHH,,12/07/2018 00:00,SUN,0,,,,,,,
2226,MAIN STREET,CNR AVON CT,GENERAL PATH - HIGH FOOT FALL,434361.4956,439853.0121,HAREWOOD,METAL SQUARE,POSTBOX 4 SIDES WITH SELF CLOSING ASHTRAY,500MM X 500MM BALLAST ONLY,120 LITRES,LCC LOGO DOG WASTE ACCEPTED,JET BLACK - RAL 9005,GOOD,NONE,,,17/10/2020 00:00,MON,0,,,,,,,
2228,MEANWOOD ROAD,,GENERAL PATH - HIGH FOOT FALL,430139.9201,435133.0687,LITTLE LONDON & WOODHOUSE,METAL SQUARE,POSTBOX 4 SIDES WITH SELF CLOSING ASHTRAY,500MM X 500MM BALLAST ONLY,120 LITRES,LCC LOGO DOG WASTE ACCEPTED,JET BLACK - RAL 9005,GOOD,NONE,HHH,,12/07/2018 00:00,SUN,0,,,,,,,
2230,MELVILLE ROAD,END OF PATH,BUS STOP OR SHELTER,429692.3146,435391.0972,LITTLE LONDON & WOODHOUSE,METAL SQUARE,POSTBOX 4 SIDES WITH SELF CLOSING ASHTRAY,500MM X 500MM BALLAST ONLY,120 LITRES,LCC LOGO DOG WASTE ACCEPTED,JET BLACK - RAL 9005,GOOD,NONE,HHH,,14/04/2023 00:00,SUN,0,,,,,,,
2231,MEADOW VIEW,O/S AVTAR,SHOPS/OFFICES,428300.41,435110.24,HEADINGLEY & HYDE PARK,METAL SQUARE,POSTBOX 4 SIDES WITH SELF CLOSING ASHTRAY,500MM X 500MM BALLAST ONLY,120 LITRES,LCC LOGO DOG WASTE ACCEPTED,JET BLACK - RAL 9005,GOOD,NONE,,,22/02/2019 00:00,WED,0,,,,,,,
2232,MAIN STREET,CNR OF HASTINGS COURT,GENERAL PATH - HIGH FOOT FALL,434478.0857,439700.9294,HAREWOOD,METAL SQUARE,POSTBOX 4 SIDES WITH SELF CLOSING ASHTRAY,500MM X 500MM BALLAST ONLY,120 LITRES,LCC LOGO DOG WASTE ACCEPTED,JET BLACK - RAL 9005,GOOD,NONE,,,17/10/2020 00:00,MON,0,,,,,,,
2233,MEAGILL RISE,NR BUS STOP,BUS STOP OR SHELTER,418790.3943,446675.9533,OTLEY & YEADON,METAL SQUARE,POSTBOX 4 SIDES WITH SELF CLOSING ASHTRAY,500MM X 500MM BALLAST ONLY,120 LITRES,LCC LOGO DOG WASTE ACCEPTED,JET BLACK - RAL 9005,GOOD,NONE,,,12/06/2018 00:00,WED/SUN,0,,,,,,,
2234,MEANWOOD ROAD,AT BUS STOP,BUS STOP OR SHELTER,428887.3086,436518.0763,CHAPEL ALLERTON,METAL SQUARE,POSTBOX 4 SIDES WITH SELF CLOSING ASHTRAY,500MM X 500MM BALLAST ONLY,120 LITRES,LCC LOGO DOG WASTE ACCEPTED,JET BLACK - RAL 9005,GOOD,NONE,,,01/07/2019 00:00,DAILY,0,,,,,,,
2235,MEANWOOD ROAD,AT BUS STOP,BUS STOP OR SHELTER,429680.3448,435817.1535,CHAPEL ALLERTON,METAL SQUARE,POSTBOX 4 SIDES WITH SELF CLOSING ASHTRAY,500MM X 500MM BALLAST ONLY,120 LITRES,LCC LOGO DOG WASTE ACCEPTED,JET BLACK - RAL 9005,GOOD,NONE,,,01/08/2019 00:00,THU/SUN,,,,,,,,
2237,MERRION STREET,CAFE NERO,TAKEAWAY,430078.47,433968.08,LITTLE LONDON & WOODHOUSE,METAL SQUARE,POSTBOX 4 SIDES WITH SELF CLOSING ASHTRAY,500MM X 500MM BALLAST ONLY,120 LITRES,LCC LOGO DOG WASTE ACCEPTED,JET BLACK - RAL 9005,GOOD,NONE,CITY CENTRE MANAGEMENT,,22/09/2020 00:00,DAILY,0,,,,,,,
2238,MERRION STREET,CAFE NERO,TAKEAWAY,430078.47,433968.08,LITTLE LONDON & WOODHOUSE,METAL SQUARE,POSTBOX 4 SIDES WITH SELF CLOSING ASHTRAY,500MM X 500MM BALLAST ONLY,120 LITRES,LCC LOGO DOG WASTE ACCEPTED,JET BLACK - RAL 9005,GOOD,NONE,CITY CENTRE MANAGEMENT,,22/09/2020 00:00,DAILY,0,,,,,,,
2239,MEANWOOD ROAD,,SHOPS/OFFICES,428634.64,436841.49,WEETWOOD,METAL SQUARE,POSTBOX 4 SIDES WITH SELF CLOSING ASHTRAY,500MM X 500MM BALLAST ONLY,120 LITRES,LCC LOGO DOG WASTE ACCEPTED,JET BLACK - RAL 9005,GOOD,NONE,,,19/10/2020 00:00,MON/WED/SAT,0,,,,,,,
1508,HEADINGLEY LANE,AT BUS STOP,BUS STOP OR SHELTER,428859.5369,435530.0598,HEADINGLEY & HYDE PARK,METAL SQUARE,POSTBOX 4 SIDES WITH SELF CLOSING ASHTRAY,500MM X 500MM BALLAST ONLY,120 LITRES,LCC LOGO DOG WASTE ACCEPTED,JET BLACK - RAL 9005,GOOD,NONE,,,25/06/2018 00:00,TUE,0,,,,,,,
1509,HEADINGLEY LANE,CNR OF RICHMOND RD,GENERAL PATH - HIGH FOOT FALL,428335.7702,435736.7771,HEADINGLEY & HYDE PARK,METAL TWIN,POSTBOX FRONT AND BACK,GROUND BOLTS,TWIN LINERS,LCC LOGO,GREY,POOR,NO LOCK,,,12/05/2018 00:00,TUE,0,,,,,,,
1510,GALLOWAY LANE,AT BUS SHELTER,GENERAL PATH - HIGH FOOT FALL,420360.0054,434179.0104,CALVERLEY & FARSLEY,METAL SQUARE,POSTBOX 4 SIDES WITH SELF CLOSING ASHTRAY,500MM X 500MM BALLAST ONLY,120 LITRES,LCC LOGO DOG WASTE ACCEPTED,JET BLACK - RAL 9005,GOOD,NONE,,,28/08/2018 00:00,TUE,0,,,,,,,
1512,HEADINGLEY LANE,JCT BUCKINGHAM RD,GENERAL PATH - HIGH FOOT FALL,428443.8142,435700.1368,HEADINGLEY & HYDE PARK,METAL TWIN,POSTBOX FRONT AND BACK,GROUND BOLTS,TWIN LINERS,LCC LOGO,GREY,POOR,NO LOCK,,,25/06/2018 00:00,TUE,0,,,,,,,
1513,HEADINGLEY LANE,,GENERAL PATH - HIGH FOOT FALL,428073.6332,435960.1411,HEADINGLEY & HYDE PARK,PLASTIC ROUND,OPEN TOP,GROUND BOLTS,80 LITRES,LCC LOGO,BLACK,FAIR,NONE,,,25/06/2018 00:00,DAILY,0,,,,,,,
1514,HEADINGLEY LANE,,GENERAL PATH - HIGH FOOT FALL,428049.9117,435954.0583,HEADINGLEY & HYDE PARK,PLASTIC ROUND,OPEN TOP,GROUND BOLTS,80 LITRES,LCC LOGO,BLACK,FAIR,NONE,,,25/06/2018 00:00,DAILY,0,,,,,,,
1507,HAWKSWORTH LANE,NEAR TO PARK,GENERAL PATH - HIGH FOOT FALL,417251.5073,441580.4641,GUISELEY & RAWDON,METAL TWIN,POSTBOX FRONT AND BACK,GROUND BOLTS,TWIN LINERS,LCC LOGO,GREY,FAIR,NONE,,,12/07/2018 00:00,THU/SUN,0,,,,,,,
1752,KIRKGATE,ENTRANCE TO ST PETERS PARK,MONUMENT/BENCH/POW/CAR PARK,430772.49,433346.35,HUNSLET & RIVERSIDE,METAL SQUARE,POSTBOX 4 SIDES WITH SELF CLOSING ASHTRAY,500MM X 500MM BALLAST ONLY,120 LITRES,LCC LOGO DOG WASTE ACCEPTED,JET BLACK - RAL 9005,GOOD,NONE,CITY CENTRE MANAGEMENT,,22/09/2020 00:00,DAILY,0,,,,,,,
1753,KIRKGATE,KIRKGATE CHAMBERS,SHOPS/OFFICES,430424.75,433468.34,LITTLE LONDON & WOODHOUSE,METAL SQUARE,POSTBOX 4 SIDES WITH SELF CLOSING ASHTRAY,500MM X 500MM BALLAST ONLY,120 LITRES,LCC LOGO DOG WASTE ACCEPTED,JET BLACK - RAL 9005,GOOD,NONE,CITY CENTRE MANAGEMENT,,22/09/2020 00:00,DAILY,0,,,,,,,
1754,KIRKGATE,KITTY CAFE,TAKEAWAY,430270.97,433530.53,LITTLE LONDON & WOODHOUSE,METAL SQUARE,POSTBOX 4 SIDES WITH SELF CLOSING ASHTRAY,500MM X 500MM BALLAST ONLY,120 LITRES,LCC LOGO DOG WASTE ACCEPTED,JET BLACK - RAL 9005,GOOD,NONE,CITY CENTRE MANAGEMENT,,22/09/2020 00:00,DAILY,0,,,,,,,
1755,KINGS APPROACH,END OF PATH,GENERAL PATH - HIGH FOOT FALL,425300.06,434502.09,ARMLEY,METAL SQUARE,POSTBOX 4 SIDES WITH SELF CLOSING ASHTRAY,500MM X 500MM BALLAST ONLY,120 LITRES,LCC LOGO DOG WASTE ACCEPTED,JET BLACK - RAL 9005,GOOD,NONE,,,12/08/2018 00:00,MON/WED/SAT,0,,,,,,,
1756,KINGS CLOSE,O/S OTLEY & ALL SATINTS SCHOOL,SCHOOL/NURSERY,421012.88,445268.4,OTLEY & YEADON,METAL TWIN,POSTBOX FRONT AND BACK,GROUND BOLTS,TWIN LINERS,LCC LOGO,GREY,FAIR,NONE,,,11/06/2018 00:00,MON,0,,,,,,,
1757,KINGSWEAR PARADE,,MONUMENT/BENCH/POW/CAR PARK,436651.66,434164.22,CROSSGATES & WHINMOOR,METAL SQUARE,POSTBOX 4 SIDES WITH SELF CLOSING ASHTRAY,500MM X 500MM BALLAST ONLY,120 LITRES,LCC LOGO DOG WASTE ACCEPTED,JET BLACK - RAL 9005,GOOD,NONE,,,01/06/2019 00:00,DAILY,0,,,,,,,
1758,KIPPAX PLACE,NR SCHOOL,SCHOOL/NURSERY,431671.47,432974.6,BURMANTOFTS & RICHMOND HILL,METAL SQUARE,POSTBOX 4 SIDES WITH SELF CLOSING ASHTRAY,500MM X 500MM BALLAST ONLY,120 LITRES,LCC LOGO DOG WASTE ACCEPTED,JET BLACK - RAL 9005,GOOD,NONE,,,12/05/2018 00:00,DAILY,0,,,,,,,
1759,KIRK LANE,,GENERAL PATH - HIGH FOOT FALL,420210.3075,441147.3725,GUISELEY & RAWDON,METAL SQUARE,POSTBOX 4 SIDES WITH SELF CLOSING ASHTRAY,500MM X 500MM BALLAST ONLY,120 LITRES,LCC LOGO DOG WASTE ACCEPTED,JET BLACK - RAL 9005,GOOD,NONE,,,12/07/2018 00:00,THU/SUN,0,,,,,,,
1760,KIRK LANE,O/S PO,SHOPS/OFFICES,420276.2617,441131.9392,GUISELEY & RAWDON,METAL TWIN,POSTBOX FRONT AND BACK,GROUND BOLTS,TWIN LINERS,LCC LOGO,GREY,FAIR,NONE,,,12/07/2018 00:00,THU/SUN,0,,,,,,,
1761,KIRK MILLS,END OF PATH,MONUMENT/BENCH/POW/CAR PARK,438068.67,440421.21,HAREWOOD,PLASTIC POST,POSTBOX FRONT,METAL STRAP,80 LITRES,LCC LOGO,YELLOW- RAL 1023,POOR,NO LINER,,,17/10/2020 00:00,MON,0,,,,,,,
1762,KIRKFIELD LANE,END OF PATH,MONUMENT/BENCH/POW/CAR PARK,438327.72,440535.2,HAREWOOD,METAL SQUARE,POSTBOX 4 SIDES WITH SELF CLOSING ASHTRAY,500MM X 500MM BALLAST ONLY,120 LITRES,LCC LOGO DOG WASTE ACCEPTED,JET BLACK - RAL 9005,GOOD,NONE,,,17/10/2020 00:00,MON,0,,,,,,,
1763,KIRKGATE,,MONUMENT/BENCH/POW/CAR PARK,420187.7528,445530.3979,OTLEY & YEADON,IRON SQUARE,POSTBOX 4 SIDES WITH SELF CLOSING ASHTRAY,GROUND BOLTS,120 LITRES,LCC LOGO,JET BLACK - RAL 9005,FAIR,NONE,,,19/10/2020 00:00,DAILY,0,,,,,,,
1764,HOLMSLEY LANE,,GENERAL PATH - HIGH FOOT FALL,435411.52,428913.38,ROTHWELL,METAL SQUARE,POSTBOX 4 SIDES WITH SELF CLOSING ASHTRAY,500MM X 500MM BALLAST ONLY,120 LITRES,LCC LOGO DOG WASTE ACCEPTED,JET BLACK - RAL 9005,GOOD,NONE,,,22/09/2020 00:00,DAILY,0,,,,,,,
1765,KIRKGATE,KITTY CAFE,TAKEAWAY,430279.49,433541.07,LITTLE LONDON & WOODHOUSE,METAL SQUARE,POSTBOX 4 SIDES WITH SELF CLOSING ASHTRAY,500MM X 500MM BALLAST ONLY,120 LITRES,LCC LOGO DOG WASTE ACCEPTED,JET BLACK - RAL 9005,GOOD,NONE,CITY CENTRE MANAGEMENT,,22/09/2020 00:00,DAILY,0,,,,,,,
1988,LINCOLN GREEN ROAD,,GENERAL PATH - HIGH FOOT FALL,431096.2421,434245.4108,LITTLE LONDON & WOODHOUSE,METAL SQUARE,POSTBOX 4 SIDES WITH SELF CLOSING ASHTRAY,500MM X 500MM BALLAST ONLY,120 LITRES,LCC LOGO DOG WASTE ACCEPTED,JET BLACK - RAL 9005,GOOD,NONE, ,,12/07/2011 00:00,MON,0,,,,,,,
1989,LINCOMBE DRIVE,CNR LINCOMBE MT,GENERAL PATH - HIGH FOOT FALL,431066.9198,437725.6151,ROUNDHAY,METAL TWIN,POSTBOX FRONT AND BACK,GROUND BOLTS,TWIN LINERS,LCC LOGO,GREY,FAIR,NONE,,,12/07/2018 00:00,MON/WED/SAT,0,,,,,,,
1993,LOVELL PARK ROAD,,GENERAL PATH - HIGH FOOT FALL,430442.74,434345.26,LITTLE LONDON & WOODHOUSE,METAL SQUARE,POSTBOX 4 SIDES WITH SELF CLOSING ASHTRAY,500MM X 500MM BALLAST ONLY,120 LITRES,LCC LOGO DOG WASTE ACCEPTED,JET BLACK - RAL 9005,GOOD,NONE,HHH,,12/07/2018 00:00,SUN,0,,,,,,,
1994,LINDSEY ROAD,,GENERAL PATH - HIGH FOOT FALL,431328.95,434194.47,BURMANTOFTS & RICHMOND HILL,METAL SQUARE,POSTBOX 4 SIDES WITH SELF CLOSING ASHTRAY,500MM X 500MM BALLAST ONLY,120 LITRES,LCC LOGO DOG WASTE ACCEPTED,JET BLACK - RAL 9005,GOOD,NONE, ,,12/07/2011 00:00,MON,0,,,,,,,
1995,LINGFIELD APPROACH,OUTSIDE SHOPS/OFFICES,SHOPS/OFFICES,430092.25,439324.24,ALWOODLEY,METAL WIRE,OPEN TOP,GROUND BOLTS,60 LITRES,LCC LOGO,BLACK,GOOD,NONE,,,17/09/2021 00:00,MON,0,,,,,,,
1996,LINGFIELD DRIVE,OUTSIDE SHOPS/OFFICES,SHOPS/OFFICES,430048.36,439313.2,ALWOODLEY,METAL WIRE,OPEN TOP,GROUND BOLTS,60 LITRES,LCC LOGO,BLACK,GOOD,NONE,,,17/09/2021 00:00,MON,0,,,,,,,
1997,LINGFIELD DRIVE,JCT WITH RING ROAD,GENERAL PATH - HIGH FOOT FALL,430490.3,439276.1,ALWOODLEY,METAL TWIN,POSTBOX FRONT AND BACK,GROUND BOLTS,TWIN LINERS,LCC LOGO,GREY,POOR,DOOR WONT LOCK,,,17/09/2021 00:00,MON,0,,,,,,,
1998,LINGFIELD HILL,BUS STOP,BUS STOP OR SHELTER,429980.6464,439355.1842,ALWOODLEY,METAL SQUARE,POSTBOX 4 SIDES WITH SELF CLOSING ASHTRAY,500MM X 500MM BALLAST ONLY,120 LITRES,LCC LOGO DOG WASTE ACCEPTED,JET BLACK - RAL 9005,GOOD,NONE,,,17/09/2021 00:00,MON,0,,,,,,,
1999,LEEDS AND BRADFORD ROAD,,GENERAL PATH - HIGH FOOT FALL,424135.58,435967.12,BRAMLEY & STANNINGLEY,METAL SQUARE,POSTBOX 4 SIDES WITH SELF CLOSING ASHTRAY,500MM X 500MM BALLAST ONLY,120 LITRES,LCC LOGO DOG WASTE ACCEPTED,JET BLACK - RAL 9005,GOOD,NONE,,,12/07/2018 00:00,MON,0,,,,,,,
2000,LEEDS AND BRADFORD ROAD,,GENERAL PATH - HIGH FOOT FALL,423554.33,435444.96,BRAMLEY & STANNINGLEY,METAL SQUARE,POSTBOX 4 SIDES WITH SELF CLOSING ASHTRAY,500MM X 500MM BALLAST ONLY,120 LITRES,LCC LOGO DOG WASTE ACCEPTED,JET BLACK - RAL 9005,GOOD,NONE,,,12/07/2018 00:00,TUE/THU,0,,,,,,,
2001,LINTON ROAD,BOTTOM OF STEPS/ENT TO CAR PARK,GENERAL PATH - HIGH FOOT FALL,439724.7,448321.5,WETHERBY,METAL SQUARE,POSTBOX 4 SIDES WITH SELF CLOSING ASHTRAY,500MM X 500MM BALLAST ONLY,120 LITRES,LCC LOGO DOG WASTE ACCEPTED,JET BLACK - RAL 9005,GOOD,NONE,,,17/10/2020 00:00,MON,0,,,,,,,
2002,LISKER DRIVE,O/S SCHOOL,SCHOOL/NURSERY,420989.58,445170.37,OTLEY & YEADON,PLASTIC POST,POSTBOX FRONT,METAL STRAP,80 LITRES,LCC LOGO,YELLOW- RAL 1023,FAIR,NONE,,,12/06/2018 00:00,MON,0,,,,,,,
2003,LEEDS ROAD,CNR BIRCH RD,GENERAL PATH - HIGH FOOT FALL,441246.15,431119.02,KIPPAX & METHLEY,METAL SQUARE,POSTBOX 4 SIDES WITH SELF CLOSING ASHTRAY,500MM X 500MM BALLAST ONLY,120 LITRES,LCC LOGO DOG WASTE ACCEPTED,JET BLACK - RAL 9005,GOOD,NONE,,,16/04/2019 00:00,TUE,0,,,,,,,
2004,LOVELL PARK ROAD,,GENERAL PATH - HIGH FOOT FALL,430415.8165,434295.4762,LITTLE LONDON & WOODHOUSE,METAL SQUARE,POSTBOX 4 SIDES WITH SELF CLOSING ASHTRAY,500MM X 500MM BALLAST ONLY,120 LITRES,LCC LOGO DOG WASTE ACCEPTED,JET BLACK - RAL 9005,GOOD,NONE,HHH,,12/07/2018 00:00,SUN,0,,,,,,,
2241,MEANWOOD ROAD,,SHOPS/OFFICES,428627.42,436870.86,WEETWOOD,METAL SQUARE,POSTBOX 4 SIDES WITH SELF CLOSING ASHTRAY,500MM X 500MM BALLAST ONLY,120 LITRES,LCC LOGO DOG WASTE ACCEPTED,JET BLACK - RAL 9005,GOOD,NONE,,,19/10/2020 00:00,MON/WED/SAT,0,,,,,,,
2242,MEANWOOD ROAD,,GENERAL PATH - HIGH FOOT FALL,428727.1319,436743.1377,WEETWOOD,METAL TWIN,POSTBOX FRONT AND BACK,GROUND BOLTS,TWIN LINERS,LCC LOGO,GREY,FAIR,RUST,,,19/10/2020 00:00,WED/SAT,0,,,,,,,
2243,MERRION STREET,KFC,TAKEAWAY,430078.47,433968.08,LITTLE LONDON & WOODHOUSE,METAL SQUARE,POSTBOX 4 SIDES WITH SELF CLOSING ASHTRAY,500MM X 500MM BALLAST ONLY,120 LITRES,LCC LOGO DOG WASTE ACCEPTED,JET BLACK - RAL 9005,GOOD,NONE,CITY CENTRE MANAGEMENT,,22/09/2020 00:00,DAILY,0,,,,,,,
2244,MERRION STREET,O/S PICTURE HOUSE,SHOPS/OFFICES,430078.47,433968.08,LITTLE LONDON & WOODHOUSE,METAL SQUARE,POSTBOX 4 SIDES WITH SELF CLOSING ASHTRAY,500MM X 500MM BALLAST ONLY,120 LITRES,LCC LOGO DOG WASTE ACCEPTED,JET BLACK - RAL 9005,GOOD,NONE,CITY CENTRE MANAGEMENT,,22/09/2020 00:00,DAILY,0,,,,,,,
2245,MERRION STREET,OPP WRENS,PUB,430318.34,433887.84,LITTLE LONDON & WOODHOUSE,METAL SQUARE,POSTBOX 4 SIDES WITH SELF CLOSING ASHTRAY,500MM X 500MM BALLAST ONLY,120 LITRES,LCC LOGO DOG WASTE ACCEPTED,JET BLACK - RAL 9005,GOOD,NONE,CITY CENTRE MANAGEMENT,,22/09/2020 00:00,DAILY,0,,,,,,,
2246,MERRION STREET,SANTANDER,SHOPS/OFFICES,430078.47,433968.08,LITTLE LONDON & WOODHOUSE,METAL SQUARE,POSTBOX 4 SIDES WITH SELF CLOSING ASHTRAY,500MM X 500MM BALLAST ONLY,120 LITRES,LCC LOGO DOG WASTE ACCEPTED,JET BLACK - RAL 9005,GOOD,NONE,CITY CENTRE MANAGEMENT,,22/09/2020 00:00,DAILY,0,,,,,,,
2247,MEANWOOD ROAD,,SHOPS/OFFICES,428652.5751,436851.3024,WEETWOOD,METAL SQUARE,POSTBOX 4 SIDES WITH SELF CLOSING ASHTRAY,500MM X 500MM BALLAST ONLY,120 LITRES,LCC LOGO DOG WASTE ACCEPTED,JET BLACK - RAL 9005,GOOD,NONE,,,19/10/2020 00:00,MON/WED/SAT,0,,,,,,,
2248,MEANWOOD ROAD,OPP PARK,MONUMENT/BENCH/POW/CAR PARK,429004.84,436366.69,CHAPEL ALLERTON,METAL TWIN,POSTBOX FRONT AND BACK,GROUND BOLTS,TWIN LINERS,LCC LOGO,GREY,POOR,RUST,,,12/07/2018 00:00,DAILY,0,,,,,,,
2249,MEANWOOD ROAD,,SHOPS/OFFICES,428611.3,436918.7713,WEETWOOD,METAL SQUARE,POSTBOX 4 SIDES WITH SELF CLOSING ASHTRAY,500MM X 500MM BALLAST ONLY,120 LITRES,LCC LOGO DOG WASTE ACCEPTED,JET BLACK - RAL 9005,GOOD,NONE,,,19/10/2020 00:00,MON/WED/SAT,0,,,,,,,
2250,MEANWOOD STREET,,GENERAL PATH - HIGH FOOT FALL,430436.6682,434506.604,LITTLE LONDON & WOODHOUSE,METAL SQUARE,POSTBOX 4 SIDES WITH SELF CLOSING ASHTRAY,500MM X 500MM BALLAST ONLY,120 LITRES,LCC LOGO,JET BLACK - RAL 9005,FAIR,RUST,HHH,,12/07/2018 00:00,SUN,0,,,,,,,
2251,MERRION STREET,TACO BELL,SHOPS/OFFICES,430078.47,433968.08,LITTLE LONDON & WOODHOUSE,METAL SQUARE,POSTBOX 4 SIDES WITH SELF CLOSING ASHTRAY,500MM X 500MM BALLAST ONLY,120 LITRES,LCC LOGO DOG WASTE ACCEPTED,JET BLACK - RAL 9005,GOOD,NONE,CITY CENTRE MANAGEMENT,,22/09/2020 00:00,DAILY,0,,,,,,,
2252,MERCURY ROW,O/S BHF,SHOPS/OFFICES,420178.0227,445498.2511,OTLEY & YEADON,METAL SQUARE,POSTBOX 4 SIDES WITH SELF CLOSING ASHTRAY,500MM X 500MM BALLAST ONLY,120 LITRES,LCC LOGO DOG WASTE ACCEPTED,JET BLACK - RAL 9005,GOOD,NONE,,,19/10/2020 00:00,DAILY,0,,,,,,,
2253,MERRION STREET,WILLIAM HILL,SHOPS/OFFICES,430078.47,433968.08,LITTLE LONDON & WOODHOUSE,METAL SQUARE,POSTBOX 4 SIDES WITH SELF CLOSING ASHTRAY,500MM X 500MM BALLAST ONLY,120 LITRES,LCC LOGO DOG WASTE ACCEPTED,JET BLACK - RAL 9005,GOOD,NONE,CITY CENTRE MANAGEMENT,,22/09/2020 00:00,DAILY,0,,,,,,,
1515,HEADINGLEY LANE,,GENERAL PATH - HIGH FOOT FALL,428377.9032,435743.6404,HEADINGLEY & HYDE PARK,PLASTIC POST,POSTBOX FRONT,METAL STRAP,80 LITRES,LCC LOGO,YELLOW- RAL 1023,POOR,NONE,,,12/07/2011 00:00,TUE,0,,,,,,,
1516,OTLEY ROAD,,GENERAL PATH - HIGH FOOT FALL,428001.4482,435984.6161,HEADINGLEY & HYDE PARK,METAL SQUARE,POSTBOX 4 SIDES WITH SELF CLOSING ASHTRAY,500MM X 500MM BALLAST ONLY,120 LITRES,LCC LOGO DOG WASTE ACCEPTED,JET BLACK - RAL 9005,GOOD,NONE,,,22/02/2019 00:00,DAILY,0,,,,,,,
1517,HEADINGLEY LANE,,GENERAL PATH - HIGH FOOT FALL,428738.2013,435607.9633,HEADINGLEY & HYDE PARK,METAL SQUARE,POSTBOX 4 SIDES WITH SELF CLOSING ASHTRAY,500MM X 500MM BALLAST ONLY,120 LITRES,LCC LOGO DOG WASTE ACCEPTED,JET BLACK - RAL 9005,GOOD,NONE,,,25/06/2018 00:00,TUE,0,,,,,,,
1518,HEADINGLEY MOUNT,,GENERAL PATH - HIGH FOOT FALL,427477.4979,436005.6808,HEADINGLEY & HYDE PARK,METAL TWIN,POSTBOX FRONT AND BACK,GROUND BOLTS,TWIN LINERS,LCC LOGO,GREY,POOR,NO LOCK,,,25/06/2018 00:00,WED/SAT,0,,,,,,,
1519,HEATHERDALE ROAD,O/S SHOPS,SHOPS/OFFICES,428057.2039,425765.1705,ARDSLEY & ROBIN HOOD,METAL SQUARE,POSTBOX 4 SIDES WITH SELF CLOSING ASHTRAY,500MM X 500MM BALLAST ONLY,120 LITRES,LCC LOGO DOG WASTE ACCEPTED,JET BLACK - RAL 9005,GOOD,NONE,,,12/07/2011 00:00,MON,0,,,,,,,
1520,HEBDEN APPROACH,,MONUMENT/BENCH/POW/CAR PARK,435928.7,436786.4,CROSSGATES & WHINMOOR,METAL SQUARE,POSTBOX 4 SIDES WITH SELF CLOSING ASHTRAY,500MM X 500MM BALLAST ONLY,120 LITRES,LCC LOGO DOG WASTE ACCEPTED,JET BLACK - RAL 9005,GOOD,NONE,,,01/06/2019 00:00,MON/FRI,0,,,,,,,
1521,HEIGHTS DRIVE,O/S SHOPS,SHOPS/OFFICES,425361.8904,433384.2061,FARNLEY & WORTLEY,METAL SQUARE,POSTBOX 4 SIDES WITH SELF CLOSING ASHTRAY,500MM X 500MM BALLAST ONLY,120 LITRES,LCC LOGO DOG WASTE ACCEPTED,JET BLACK - RAL 9005,GOOD,NONE,P3,,12/10/2021 00:00,MON/WED/SAT,308,,,,,,,
1523,HEIGHTS DRIVE,O/S SHOPS,SHOPS/OFFICES,425384.6,433372.41,FARNLEY & WORTLEY,METAL SQUARE,POSTBOX 4 SIDES WITH SELF CLOSING ASHTRAY,500MM X 500MM BALLAST ONLY,120 LITRES,LCC LOGO DOG WASTE ACCEPTED,JET BLACK - RAL 9005,GOOD,NONE,P3,,12/10/2021 00:00,MON/WED/SAT,307,,,,,,,
1525,GANNERS HILL,CORNER OF GANNERS ROAD,GENERAL PATH - HIGH FOOT FALL,424575.9917,435886.82,BRAMLEY & STANNINGLEY,METAL SQUARE,POSTBOX 4 SIDES WITH SELF CLOSING ASHTRAY,500MM X 500MM BALLAST ONLY,120 LITRES,LCC LOGO DOG WASTE ACCEPTED,JET BLACK - RAL 9005,GOOD,NONE,,,12/05/2018 00:00,MON,0,,,,,,,
1526,HENCONNER LANE,O/S SHOPS,SHOPS/OFFICES,425119.05,433948.1,ARMLEY,METAL SQUARE,POSTBOX 4 SIDES WITH SELF CLOSING ASHTRAY,500MM X 500MM BALLAST ONLY,120 LITRES,LCC LOGO DOG WASTE ACCEPTED,JET BLACK - RAL 9005,GOOD,NONE,,,12/08/2018 00:00,MON/WED/SAT,0,,YES,,,,,
1527,HENCONNER LANE,,GENERAL PATH - HIGH FOOT FALL,425978,433485.07,ARMLEY,METAL SQUARE,POSTBOX 4 SIDES WITH SELF CLOSING ASHTRAY,500MM X 500MM BALLAST ONLY,120 LITRES,LCC LOGO DOG WASTE ACCEPTED,JET BLACK - RAL 9005,GOOD,NONE,,,12/08/2018 00:00,MON/WED/SAT,0,,,,,,,
1529,BUTT LANE,B/S NR MCDONALDS,TAKEAWAY,425044.992,433338.6531,FARNLEY & WORTLEY,METAL SQUARE,POSTBOX 4 SIDES WITH SELF CLOSING ASHTRAY,500MM X 500MM BALLAST ONLY,120 LITRES,LCC LOGO DOG WASTE ACCEPTED,JET BLACK - RAL 9005,GOOD,NONE,P2,,12/10/2021 00:00,MON/WED/SAT,205,,,,,,,
1766,HOLMSLEY LANE,,GENERAL PATH - HIGH FOOT FALL,436019.9,429027.38,ROTHWELL,METAL SQUARE,POSTBOX 4 SIDES WITH SELF CLOSING ASHTRAY,500MM X 500MM BALLAST ONLY,120 LITRES,LCC LOGO DOG WASTE ACCEPTED,JET BLACK - RAL 9005,GOOD,NONE,,,22/09/2020 00:00,DAILY,0,,,,,,,
1767,KIRKGATE,O/S BOOTS,SHOPS/OFFICES,420182.5903,445453.2903,OTLEY & YEADON,METAL OPEN,OPEN TOP,GROUND BOLTS,80 LITRES,LCC LOGO,BLACK,FAIR,NONE,,,19/10/2020 00:00,DAILY,0,,,,,,,
1768,KIRKGATE,MEGA BUS STOP,BUS STOP OR SHELTER,430583.8,433347.36,HUNSLET & RIVERSIDE,METAL SQUARE,POSTBOX 4 SIDES WITH SELF CLOSING ASHTRAY,500MM X 500MM BALLAST ONLY,120 LITRES,LCC LOGO DOG WASTE ACCEPTED,JET BLACK - RAL 9005,GOOD,NONE,CITY CENTRE MANAGEMENT,,22/09/2020 00:00,DAILY,0,,,,,,,