OBJECTID,ROAD_NAME,LOCATION,EASTING,NORTHING,WARD,MODEL,CONDITION,DEFECTS,COMMENTS,LASTUPDATED,FREQUENCY,SEQUENCE,BINID
13856,CHURCH LANE,JUNC OF CHURCH AVENUE,438190.3,430499.13,GARFORTH & SWILLINGTON, , , , ,12/09/2018 00:00,MONDAY,0,660
13857,CHURCH LANE, ,428813.22,437775.22,MOORTOWN, , , , ,12/07/2018 00:00,FRIDAY,0,666
13858,CHURCH STREET,HUNSLET,431194.59,431487.81,HUNSLET & RIVERSIDE,METAL SQUARE,GOOD,NONE, ,12/09/2018 00:00,DAILY,0,671
13859,CHURCH STREET, ,442775.82,445461.05,WETHERBY, , , , ,12/07/2011 00:00, ,0,680
13860,CHURCH STREET, ,436308.59,429132.6,ROTHWELL, , , , ,12/07/2011 00:00, ,0,685
13861,CHURCHFIELD ROAD, ,434473.26,428470.31,ROTHWELL, , , , ,12/07/2011 00:00, ,0,691
13862,CITY SQUARE, ,429935.46,433414.14,LITTLE LONDON & WOODHOUSE, , , ,CITY CENTRE MANAGEMENT,12/07/2011 00:00,DAILY,0,699
13863,CLARENDON ROAD, ,429011.18,434338.7,LITTLE LONDON & WOODHOUSE,METAL TWIN,POOR,NO LOCK, ,25/06/2018 00:00,MONDAY,0,708
13864,CLIFFORD MOOR ROAD, ,442075.3,445253.56,WETHERBY, , , , ,12/07/2011 00:00, ,0,721
13865,CLIFFORD ROAD, ,442604.99,443324.87,WETHERBY, , , , ,12/07/2011 00:00, ,0,725
13866,CLOTH HALL STREET, ,430352.1,433388.3,LITTLE LONDON & WOODHOUSE, , , ,CITY CENTRE MANAGEMENT,12/07/2011 00:00,DAILY,0,727
13867,COCKSHOTT LANE, ,425976.09,434684.81,ARMLEY,METAL SQUARE,GOOD,NONE, ,12/08/2018 00:00,MON/THU/SAT,0,736
13868,COLDCOTES CIRCUS, ,433465.56,434828.76,GIPTON & HAREHILLS, , , , ,12/07/2018 00:00,DAILY,0,737
13869,COMMERCIAL STREET, ,430196.67,433551.97,LITTLE LONDON & WOODHOUSE, , , ,CITY CENTRE MANAGEMENT,12/07/2011 00:00,DAILY,0,751
13870,COMMERCIAL STREET, ,430183.72,433543.73,LITTLE LONDON & WOODHOUSE, , , ,CITY CENTRE MANAGEMENT,12/07/2011 00:00,DAILY,0,752
13871,COMMERCIAL STREET, ,430160.17,433557.86,LITTLE LONDON & WOODHOUSE, , , ,CITY CENTRE MANAGEMENT,12/07/2011 00:00,DAILY,0,753
13872,COMMERCIAL STREET, ,430203.39,433541.58,LITTLE LONDON & WOODHOUSE, , , ,CITY CENTRE MANAGEMENT,12/07/2011 00:00,DAILY,0,759
13873,COMMERCIAL STREET, ,430117.58,433552.94,LITTLE LONDON & WOODHOUSE, , , ,CITY CENTRE MANAGEMENT,12/07/2011 00:00,DAILY,0,760
13874,COMMERCIAL STREET, ,430088.56,433539.06,LITTLE LONDON & WOODHOUSE, , , ,CITY CENTRE MANAGEMENT,12/07/2011 00:00,DAILY,0,761
13875,COMMERCIAL STREET, ,434500.62,428133.83,ROTHWELL, , , , ,12/07/2011 00:00, ,0,764
13876,CONSTABLE ROAD, ,428868.57,425922.23,ARDSLEY & ROBIN HOOD, , , , ,12/07/2011 00:00, ,0,772
13877,COOKRIDGE STREET, ,429923.13,433906.26,LITTLE LONDON & WOODHOUSE, , , ,CITY CENTRE MANAGEMENT,12/07/2011 00:00,DAILY,0,783
13878,COOKRIDGE STREET, ,429927.47,433874.62,LITTLE LONDON & WOODHOUSE, , , ,CITY CENTRE MANAGEMENT,12/07/2011 00:00,DAILY,0,785
13879,COOKRIDGE STREET, ,429911.96,433854.77,LITTLE LONDON & WOODHOUSE, , , ,CITY CENTRE MANAGEMENT,12/07/2011 00:00,DAILY,0,786
13880,COOKRIDGE STREET, ,429913.17,433831.8,LITTLE LONDON & WOODHOUSE, , , ,CITY CENTRE MANAGEMENT,12/07/2011 00:00,DAILY,0,790
13881,CORPORATION STREET, ,426051.95,427724.91,MORLEY SOUTH, , , , ,12/07/2011 00:00, ,0,792
13882,COTE LANE, ,421111.33,434818.41,CALVERLEY & FARSLEY,METAL SQUARE,GOOD,NONE, ,28/08/2018 00:00,MONDAY,0,795
13883,COW CLOSE ROAD, ,426080.27,431875.91,FARNLEY & WORTLEY, , , , ,12/07/2011 00:00, ,0,811
13884,CRAMNER BANK,OUTSIDE SCHOOL,429356.15,439381.58,ALWOODLEY, , , , ,12/07/2011 00:00, ,0,821
13885,CRAMNER BANK,OUTSIDE SHOPS,429192.57,439124.88,ALWOODLEY, , , , ,12/07/2011 00:00, ,0,823
13886,CRAMNER BANK,OUTSIDE SHOPS,429182.35,439119.77,ALWOODLEY, , , , ,12/07/2011 00:00, ,0,825
13887,CROMWELL MOUNT, ,431298.96,434083.54,BURMANTOFTS & RICHMOND HILL, , , , ,12/07/2011 00:00, ,0,828
13888,CROSBY STREET, ,429038.02,432091.3,BEESTON & HOLBECK, , , , ,12/07/2011 00:00, ,0,836
13889,CROSSGATES ROAD, ,436054.33,434824.77,KILLINGBECK & SEACROFT, , , , ,12/07/2011 00:00, ,0,852
13908,OLD LANE, ,428787.86,430486.3,BEESTON & HOLBECK, , , , ,12/07/2011 00:00, ,0,2378
13909,OLD ROAD, ,421621.51,434920.17,CALVERLEY & FARSLEY, , , , ,28/08/2018 00:00,SUNDAY,0,2387
13910,OLDFIELD LANE, ,427407.05,432590.68,FARNLEY & WORTLEY, , , , ,12/07/2011 00:00, ,0,2393
13911,OLDFIELD LANE, ,427780.14,432621.23,FARNLEY & WORTLEY, , , , ,12/07/2011 00:00, ,0,2394
13912,OLDFIELD LANE, ,427652.29,432589.88,FARNLEY & WORTLEY, , , , ,12/07/2011 00:00, ,0,2396
13913,OTLEY OLD ROAD, ,426574.74,438631.48,WEETWOOD, , , , ,12/07/2011 00:00,MON/WED/FRI,0,2403
13914,OTLEY OLD ROAD, ,426141.78,439110.05,WEETWOOD, , , , ,12/07/2011 00:00,MON/WED/FRI,0,2405
13915,STANKS PARADE, ,436861.18,435897.39,CROSSGATES & WHINMOOR,METAL SQUARE,GOOD,NONE, ,16/04/2019 00:00,DAILY,0,12463
13890,CROSSLEY STREET, ,440158.75,448418.03,WETHERBY, , , , ,12/07/2011 00:00, ,0,853
13916,OTLEY ROAD, ,427741.3,436471.23,WEETWOOD, , , , ,12/07/2011 00:00,MON/WED/FRI,0,2410
13917,OTLEY ROAD, ,427517.64,436973.71,WEETWOOD, , , , ,12/07/2011 00:00,MON/WED/FRI,0,2412
13918,STANKS PARADE, ,436890.12,435868.45,CROSSGATES & WHINMOOR,METAL SQUARE,GOOD,NONE, ,16/04/2019 00:00,DAILY,0,12464
13919,SWARCLIFFE AVENUE, ,436696.64,436302.63,CROSSGATES & WHINMOOR,METAL SQUARE,GOOD,NONE, ,16/04/2019 00:00,MON/FRI,0,12769
13920,AUSTHORPE VIEW, ,436874.19,433697.08,CROSSGATES & WHINMOOR,METAL SQUARE,GOOD,NONE, ,01/06/2019 00:00,DAILY,0,12775
13921,AUSTHORPE LANE,ENT TO PATH ON BEND,437081.63,433885.47,CROSSGATES & WHINMOOR,METAL SQUARE,GOOD,NONE, ,01/06/2019 00:00,TUE/THU,0,12776
13922,OTLEY ROAD, ,427107,437372.54,WEETWOOD, , , , ,12/07/2011 00:00,MON/WED/FRI,0,2414
13923,OTLEY ROAD, ,426850.13,437522.38,WEETWOOD, , , , ,12/07/2011 00:00,MON/WED/FRI,0,2415
13924,OTLEY ROAD, ,426967.51,439864.66,ADEL & WHARFEDALE, , , , ,11/06/2018 00:00,MON/FRI,0,2431
13925,OTLEY ROAD, ,426919.04,439623.52,ADEL & WHARFEDALE, , , , ,11/06/2018 00:00,DAILY,0,2441
13926,OTLEY ROAD, ,426920.55,439614.3,ADEL & WHARFEDALE, , , , ,11/06/2018 00:00,DAILY,0,2442
13927,OTLEY ROAD, ,426921.66,439334.15,ADEL & WHARFEDALE, , , , ,11/06/2018 00:00,MON/FRI,0,2444
13928,OTLEY ROAD,AT BUS STOP,419070.47,441926.53,GUISELEY & RAWDON,METAL SQUARE,GOOD,NONE, ,12/05/2018 00:00,MON/THU/SUN,0,2451
13929,OTLEY ROAD, ,426817.05,437971.82,WEETWOOD, , , , ,12/07/2011 00:00,MON/WED/FRI,0,2463
13891,CROSSLEY STREET, ,440422.77,448414.79,WETHERBY, , , , ,12/07/2011 00:00, ,0,854
13930,OTLEY ROAD, ,426855.79,437644.01,WEETWOOD, , , , ,12/07/2011 00:00,MON/WED/FRI,0,2465
13931,OTLEY ROAD, ,426950.14,437466.57,WEETWOOD, , , , ,12/07/2011 00:00,MON/WED/FRI,0,2466
13932,OTLEY ROAD, ,427181.1,437320.11,WEETWOOD, , , , ,12/07/2011 00:00,MON/WED/FRI,0,2467
13933,OTLEY ROAD, ,427357.14,437146.89,WEETWOOD, , , , ,12/07/2011 00:00,MON/WED/FRI,0,2468
13934,OTLEY ROAD, ,427596.55,436837.06,WEETWOOD, , , , ,12/07/2011 00:00,MON/WED/FRI,0,2471
13935,OULTON LANE, ,436372.68,428776,ROTHWELL, , , , ,12/07/2011 00:00, ,0,2488
13936,OWLCOTES ROAD, ,421222.67,433589.49,PUDSEY,METAL SQUARE,GOOD,NONE, ,12/07/2018 00:00,TUESDAY,0,2494
13937,PARK AVENUE, ,432678.03,436944.24,ROUNDHAY, , , , ,12/07/2018 00:00,MONDAY,0,2506
13892,CROWN POINT ROAD, ,430725.51,433037.17,HUNSLET & RIVERSIDE, , , ,CITY CENTRE MANAGEMENT,12/07/2011 00:00, ,0,857
13893,CROWN STREET, ,430407.81,433378.8,LITTLE LONDON & WOODHOUSE, , , ,CITY CENTRE MANAGEMENT,12/07/2011 00:00,DAILY,0,860
13894,CUMBERLAND ROAD, ,428767.15,435882.21,HEADINGLEY & HYDE PARK,METAL TWIN,POOR,NO LOCK, ,25/06/2018 00:00,TUESDAY,0,862
13895,DEIGHTON ROAD, ,440245.08,449623.85,WETHERBY, , , , ,12/07/2011 00:00, ,0,869
13896,DERWENT DRIVE, ,427907.06,439814.92,ADEL & WHARFEDALE,METAL SQUARE,GOOD,NONE, ,11/06/2018 00:00,MON/FRI,0,875
13897,DEWSBURY ROAD, ,429860.77,430698.68,HUNSLET & RIVERSIDE,METAL TWIN,POOR,NO LOCK, ,12/09/2018 00:00,DAILY,0,877
13898,NORTH LANE,O/S BOTTLE BANKS,427768.24,436146.9,HEADINGLEY & HYDE PARK,METAL SQUARE,GOOD,NONE, ,25/06/2018 00:00,DAILY,0,2317
13899,NORTH LANE,O/S SUNTAN CENTRE REPLACE PM,427837.76,436180.5,HEADINGLEY & HYDE PARK,METAL SQUARE,GOOD,NONE, ,12/07/2018 00:00,DAILY,0,2318
13900,NORTH LANE,O/S TAPS BENNETT ROAD SIDE OF BOTTLE BANKS,427809.98,436153.53,HEADINGLEY & HYDE PARK,METAL TWIN,POOR,NO DOOR, ,25/06/2018 00:00,DAILY,0,2319
13901,NORTH LANE, ,436071.43,428725.88,ROTHWELL, , , , ,12/07/2011 00:00, ,0,2321
13902,NORTH STREET, ,440478.11,448383.33,WETHERBY, , , , ,12/07/2011 00:00, ,0,2338
13903,NURSERY LANE, ,430070.68,439630.84,ALWOODLEY, , , , ,12/07/2011 00:00, ,0,2346
13904,OAKWOOD LANE, ,433578.57,435650.64,GIPTON & HAREHILLS, , , , ,12/07/2018 00:00,DAILY,0,2361
13905,OATLAND DRIVE,IN CAR PARK,430353.13,434727.8,LITTLE LONDON & WOODHOUSE,METAL SQUARE,GOOD,NONE, ,12/07/2018 00:00,SUNDAY,0,2369
13906,OLD LANE, ,428820.61,430394.34,BEESTON & HOLBECK, , , , ,12/07/2011 00:00, ,0,2373
13907,OLD LANE, ,428935.6,429881.9,BEESTON & HOLBECK, , , , ,12/07/2011 00:00, ,0,2375
13938,PLANTATION GARDENS, ,432322.28,440289.1,ALWOODLEY, , , , ,12/07/2011 00:00, ,0,2555
13939,PLAYGROUND, ,424799.86,431211.96,FARNLEY & WORTLEY, , , , ,12/07/2011 00:00, ,0,2556
13940,PONTEFRACT LANE, ,431883.25,433082.85,BURMANTOFTS & RICHMOND HILL, , , , ,12/07/2011 00:00, ,0,2558
13941,PONTEFRACT LANE, ,431956.63,433037.42,BURMANTOFTS & RICHMOND HILL, , , , ,12/07/2011 00:00, ,0,2559
13942,POOLE CRESCENT, ,435688.24,434724.88,KILLINGBECK & SEACROFT, , , , ,12/07/2011 00:00, ,0,2563
13943,PORTLAND COURT, ,429876.6,434076.84,LITTLE LONDON & WOODHOUSE, , , ,CITY CENTRE MANAGEMENT,12/07/2011 00:00,DAILY,0,2564
13944,POTTERNEWTON LANE, ,430177,436617.23,CHAPEL ALLERTON, , , , ,12/07/2018 00:00,SATURDAY,0,2574
13945,POTTERNEWTON LANE, ,430005.92,436608.14,CHAPEL ALLERTON, , , , ,12/07/2018 00:00,SATURDAY,0,2576
13808,HOLMSLEY LANE, ,436077.63,429028.38,ROTHWELL, , , , ,12/07/2011 00:00, ,0,1497
13809,HOLMSLEY LANE, ,435744.71,428970.92,ROTHWELL, , , , ,12/07/2011 00:00, ,0,1501
13810,HOLMSLEY LANE, ,435535.72,428947.26,ROTHWELL, , , , ,12/07/2011 00:00, ,0,1504
13811,HOLTDALE APPROACH, ,425890.34,440035.29,ADEL & WHARFEDALE,METAL TWIN,POOR,SURFACE RUST, ,11/06/2018 00:00,WED/SAT,0,1507
13812,HOXTON MOUNT, ,428555.5,431365.51,BEESTON & HOLBECK, , , , ,12/07/2011 00:00, ,0,1515
13813,HUNSLET HALL ROAD, ,429762.03,431851.1,HUNSLET & RIVERSIDE,METAL TWIN,POOR,NO LOCK, ,12/07/2018 00:00,TUESDAY,0,1519
13814,INFIRMARY STREET, ,429907.07,433492.93,LITTLE LONDON & WOODHOUSE, , , ,CITY CENTRE MANAGEMENT,12/07/2011 00:00,DAILY,0,1525
13815,IVEGATE,ENTRANCE TO CAR PARK,420693.94,441026.12,OTLEY & YEADON,METAL SQUARE,GOOD,NONE, ,11/06/2018 00:00,DAILY,0,1544
17427,HEADINGLEY LANE,AT BUS STOP,428857.92,435527.12,HEADINGLEY & HYDE PARK,METAL SQUARE,GOOD,NONE, ,25/06/2018 00:00,TUESDAY,0,7209
17428,VICOTRIA ROAD,O/S FRANCOS,428712.23,435474.47,HEADINGLEY & HYDE PARK,METAL SQUARE,FAIR,PAINT, ,22/02/2019 00:00,THURSDAY,0,7215
17429,VISTORIA ROAD, ,428510.07,435474.49,HEADINGLEY & HYDE PARK,METAL TWIN,POOR,NO DOOR, ,25/06/2018 00:00,THURSDAY,0,7216
17430,HANOVER WALK,OPP COLLEGE,429255.08,433869.45,LITTLE LONDON & WOODHOUSE,METAL TWIN,FAIR,NONE, ,26/06/2018 00:00,MONDAY,0,7231
17431,HANOVER WALK,OS COLLEGE,429227.3,433891.94,LITTLE LONDON & WOODHOUSE,METAL TWIN,FAIR,NONE, ,26/06/2018 00:00,MONDAY,0,7232
17432,BRADFORD ROAD,JCTN HAWKSWORTH LN,418297.85,441386.37,GUISELEY & RAWDON,METAL TWIN,FAIR,NONE, ,12/07/2018 00:00,MON/THU/SUN,0,7554
17433,OXFORD ROAD,O/S SHOPS,419257.47,442208.26,GUISELEY & RAWDON,METAL TWIN,FAIR,NONE, ,12/07/2018 00:00,MON/THU/SUN,0,7568
17434,OXFORD ROAD, ,419144.17,442167.54,GUISELEY & RAWDON,PLASTIC ROUND,POOR,NO LINER, ,12/07/2018 00:00,MON/THU/SUN,0,7570
14136,BRACKENWOOD DRIVE, ,431536.52,437402.96,ROUNDHAY, , , , ,12/07/2018 00:00,WEDNESDAY,0,322
14137,BRACKENWOOD DRIVE, ,431516.84,437410.53,ROUNDHAY, , , , ,12/07/2018 00:00,WEDNESDAY,0,323
14138,GUISELEY DRIVE, ,417896.26,442665.93,GUISELEY & RAWDON,METAL SQUARE,GOOD,NONE, ,12/07/2018 00:00,MON/THU/SUN,0,334
14139,BRADFORD ROAD, ,420121.04,434160.32,CALVERLEY & FARSLEY,METAL TWIN,FAIR,NONE, ,28/08/2018 00:00,TUESDAY,0,341
14140,BRADFORD ROAD, ,428315.13,426119.25,ARDSLEY & ROBIN HOOD, , , , ,12/07/2011 00:00, ,0,345
14141,BRADFORD ROAD, ,428591.86,426031.23,ARDSLEY & ROBIN HOOD, , , , ,12/07/2011 00:00, ,0,347
14142,BRADFORD ROAD, ,429013.64,425960.11,ARDSLEY & ROBIN HOOD, , , , ,12/07/2011 00:00, ,0,349
14143,BRADFORD ROAD, ,421979.24,434341.01,CALVERLEY & FARSLEY,METAL SQUARE,GOOD,NONE, ,28/08/2018 00:00,MONDAY,0,366
14144,BRADFORD ROAD, ,420565.31,434347.25,CALVERLEY & FARSLEY, , , , ,28/08/2018 00:00,TUESDAY,0,373
14145,BRANDER STREET, ,433615.6,434584.08,GIPTON & HAREHILLS, , , , ,12/07/2018 00:00,WED/SUN,0,388
14146,BRIDGE ROAD, ,443176.62,445721.75,WETHERBY, , , , ,12/07/2011 00:00, ,0,396
14147,BRIDGE STREET, ,426777.62,426759.77,MORLEY SOUTH, , , , ,12/07/2011 00:00, ,0,404
14148,BRIDLE FOOT, ,443329.14,445929.25,WETHERBY, , , , ,12/07/2011 00:00, ,0,406
14149,BRIGGATE, ,430248.82,433661.46,LITTLE LONDON & WOODHOUSE, , , ,CITY CENTRE MANAGEMENT,12/07/2011 00:00,DAILY,0,407
14150,BRIGGATE, ,430265.22,433662.72,LITTLE LONDON & WOODHOUSE, , , ,CITY CENTRE MANAGEMENT,12/07/2011 00:00,DAILY,0,409
14151,BRITANNIA ROAD, ,426932.29,426593.26,MORLEY SOUTH, , , , ,12/07/2011 00:00, ,0,425
14152,BROAD LANE, ,424155.59,435531.51,BRAMLEY & STANNINGLEY,METAL SQUARE,GOOD,NONE, ,12/07/2018 00:00,TUESDAY,0,438
14153,BROADWAY, ,424059.07,437721.01,HORSFORTH, , , , ,12/07/2011 00:00,TUE/THU/SAT,0,445
14154,BROADWAY, ,424046.58,437708.52,HORSFORTH, , , , ,12/07/2011 00:00,TUE/THU/SAT,0,446
14155,BROADWAY, ,425376.08,436986.35,KIRKSTALL,METAL SQUARE,GOOD,NONE, ,12/07/2018 00:00,DAILY,0,447
14156,BROOM ROAD, ,431537.44,429243.67,MIDDLETON PARK,METAL SQUARE,GOOD,NONE, ,12/05/2018 00:00,WEDNESDAY,0,449
14157,BODMIN ROAD, ,429103.89,428612.93,MIDDLETON PARK,METAL SQUARE,GOOD,NONE, ,12/05/2018 00:00,TUESDAY,0,453
14158,BROWNBERRIE AVENUE, ,424252.41,439015.93,HORSFORTH, , , , ,12/07/2011 00:00,DAILY,0,459
14159,BROWNBERRIE LANE, ,423301.37,439346.77,HORSFORTH, , , , ,12/07/2011 00:00,TUE/THU/SAT,0,460
14160,BROWNBERRIE LANE, ,423309.05,439328.56,HORSFORTH, , , , ,12/07/2011 00:00,TUE/THU/SAT,0,461
14161,BRUDENELL ROAD,O/S POST OFFICE,428348.13,435157.08,HEADINGLEY & HYDE PARK,METAL TWIN,FAIR,NONE, ,25/06/2018 00:00,DAILY,0,468
14162,BRUNSWICK STREET, ,426041.02,428158.87,MORLEY SOUTH, , , , ,12/07/2011 00:00, ,0,471
14163,BUCKSTONE ROAD, ,428984.66,439874.86,ALWOODLEY, , , , ,12/07/2011 00:00, ,0,476
14164,BUCKSTONE ROAD, ,429080.91,439794.07,ALWOODLEY, , , , ,12/07/2011 00:00, ,0,477
14169,CALVERLEY STREET, ,429807.75,434014.19,LITTLE LONDON & WOODHOUSE, , , ,CITY CENTRE MANAGEMENT,12/07/2011 00:00,DAILY,0,514
14170,CALVERLEY STREET, ,429730.21,434182.3,LITTLE LONDON & WOODHOUSE, , , ,CITY CENTRE MANAGEMENT,12/07/2011 00:00,DAILY,0,517
14171,CALVERLEY STREET, ,429835.02,433828.3,LITTLE LONDON & WOODHOUSE, , , ,CITY CENTRE MANAGEMENT,12/07/2011 00:00,DAILY,0,518
14172,CALVERLEY STREET, ,429785.24,433868.92,LITTLE LONDON & WOODHOUSE, , , ,CITY CENTRE MANAGEMENT,12/07/2011 00:00,DAILY,0,522
14173,CANAL STREET, ,428442.26,433326.77,ARMLEY,METAL TWIN,GOOD,NONE, ,12/08/2018 00:00,MON/THU/SAT,0,535
14174,CARDIGAN LANE, ,427704.76,434808.64,KIRKSTALL,METAL SQUARE,GOOD,NONE, ,12/07/2018 00:00,WED/SUN,0,536
14175,CARDIGAN ROAD,BUS STOP CITY BOUND FROM SPRING ROAD,427960.36,435703.3,HEADINGLEY & HYDE PARK,METAL SQUARE,GOOD,NONE, ,25/06/2018 00:00,WEDNESDAY,0,543
14176,CARDIGAN ROAD,O/S SHOPS NEAR MAYVILLE AVENUE,428069.48,435036.46,HEADINGLEY & HYDE PARK,METAL TWIN,FAIR,NONE, ,25/06/2018 00:00,WEDNESDAY,0,548
14165,BURLEY ROAD, ,427149.31,435267.29,KIRKSTALL,METAL SQUARE,GOOD,NONE, ,12/07/2018 00:00,WED/SUN,0,482
14166,BURLEY ROAD, ,427782.43,434661.55,KIRKSTALL,METAL SQUARE,GOOD,NONE, ,12/07/2018 00:00,WED/SUN,0,485
14167,BUTTERBOWL DRIVE, ,425819.59,432217.88,FARNLEY & WORTLEY, , , , ,12/07/2011 00:00, ,0,510
14177,CARDIGAN ROAD, ,428150.14,434772.09,HEADINGLEY & HYDE PARK,METAL SQUARE,GOOD,NONE, ,25/06/2018 00:00,WEDNESDAY,0,549
14178,CARLTON LANE, ,434244.92,427827.51,ROTHWELL, , , , ,12/07/2011 00:00, ,0,563
14179,CARLTON LANE, ,434147.75,427748.29,ROTHWELL, , , , ,12/07/2011 00:00, ,0,568
14180,CARR MANOR PARADE, ,429963.2,437677.41,MOORTOWN, , , , ,12/07/2018 00:00,THURSDAY,0,572
14181,CARRHOLM ROAD, ,429758.13,437059.04,MOORTOWN, , , , ,12/07/2018 00:00,THURSDAY,0,582
14182,CASTLEFIELDS, ,432611.07,428021.56,ARDSLEY & ROBIN HOOD, , , , ,12/07/2011 00:00, ,0,584
14183,CEMETERY ROAD, ,421571.92,433568.32,PUDSEY, , , , ,28/08/2018 00:00,FRIDAY,0,593
14184,CEMETERY ROAD, ,429345.25,431413.04,BEESTON & HOLBECK, , , , ,12/07/2011 00:00, ,0,594
14185,CENTRAL ROAD, ,430316.69,433451.99,LITTLE LONDON & WOODHOUSE, , , ,CITY CENTRE MANAGEMENT,12/07/2011 00:00,DAILY,0,600
14186,CHANDOS GARDENS, ,431624.33,437660.33,ROUNDHAY, , , , ,12/07/2018 00:00,WEDNESDAY,0,602
14187,CHAPELTOWN, ,421764.82,432922.66,PUDSEY,METAL SQUARE,GOOD,NONE, ,28/08/2018 00:00,FRIDAY,0,615
14188,CHAPELTOWN ROAD, ,430934.33,436062.16,CHAPEL ALLERTON, , , , ,12/07/2018 00:00,DAILY,0,622
14189,CHAPELTOWN ROAD, ,430965.87,435812.05,CHAPEL ALLERTON, , , , ,12/07/2018 00:00,DAILY,0,624
14190,CHELWOOD DRIVE, ,431629.02,438922.04,MOORTOWN, , , , ,12/07/2018 00:00,SUNDAY,0,628
14191,CHELWOOD DRIVE, ,431636.91,438876.3,MOORTOWN, , , , ,12/07/2018 00:00,SUNDAY,0,630
14192,CHURCH HILL, ,438388.36,440724.48,HAREWOOD, , , , ,12/07/2011 00:00, ,0,636
14193,CHURCH LANE, ,422091.65,433185.98,PUDSEY, , , , ,28/08/2018 00:00,DAILY,0,638
14194,CHURCH LANE, ,422172.49,433275.91,PUDSEY,PLASTIC ROUND,POOR,NOT FIXED, ,28/08/2018 00:00,DAILY,0,639
14195,CHURCH LANE, ,423913.74,438236.84,HORSFORTH, , , , ,12/07/2011 00:00,TUE/THU/SAT,0,642
14196,BENTLEY LANE, ,428673.31,436638.57,WEETWOOD, , , , ,12/07/2011 00:00,MON/WED/FRI,0,246
14197,CHURCH LANE, ,436502.94,443125.09,HAREWOOD, , , , ,12/07/2011 00:00, ,0,644
14198,CHURCH LANE,BARDSEY,436604.62,443166.01,HAREWOOD, , , , ,12/07/2011 00:00, ,0,649
14199,CHURCH LANE, ,422211.43,433338.92,PUDSEY,METAL TWIN,FAIR,NONE, ,28/08/2018 00:00,DAILY,0,654
14200,CHURCH LANE, ,422220.16,433319.61,PUDSEY, , , , ,28/08/2018 00:00,DAILY,0,655
14201,CHURCH STREET, ,442797.1,445546.18,WETHERBY, , , , ,12/07/2011 00:00, ,0,681
14202,CHURCH STREET, ,442816.61,445673.87,WETHERBY, , , , ,12/07/2011 00:00, ,0,682
14203,CHURCH STREET, ,442823.7,445705.79,WETHERBY, , , , ,12/07/2011 00:00, ,0,683
14204,CHURCH STREET, ,436431.96,429139.92,ROTHWELL, , , , ,12/07/2011 00:00, ,0,684
14205,CHURCH STREET, ,423894.14,429453.11,MORLEY NORTH, , , , ,12/07/2011 00:00, ,0,686
14206,CHURCH STREET, ,424381.67,429258.48,MORLEY NORTH, , , , ,12/07/2011 00:00, ,0,689
14207,CHURCHFIELD ROAD, ,434550.3,428474.71,ROTHWELL, , , , ,12/07/2011 00:00, ,0,692
14208,CLARENDON ROAD, ,429105.88,434696.29,LITTLE LONDON & WOODHOUSE,METAL TWIN,FAIR,NONE, ,25/06/2018 00:00,MONDAY,0,709
14209,CLIFFORD MOOR ROAD, ,442522.21,444600.93,WETHERBY, , , , ,12/07/2011 00:00, ,0,718
14210,CLIFFORD MOOR ROAD, ,442456.6,444668.32,WETHERBY, , , , ,12/07/2011 00:00, ,0,719
14211,CLIFFORD MOOR ROAD, ,442171.07,445062.02,WETHERBY, , , , ,12/07/2011 00:00, ,0,722
14212,COCKSHOT LANE, ,425852.11,434392.4,ARMLEY,METAL TWIN,FAIR,NO LOCK, ,12/08/2018 00:00,MON/THU/SAT,0,731
14213,COLDCOTES DRIVE, ,433405.85,434869.16,GIPTON & HAREHILLS, , , , ,12/07/2018 00:00,WED/SUN,0,740
14214,COMMERCIAL ROAD, ,426338.8,435479.99,KIRKSTALL,METAL SQUARE,GOOD,NONE, ,12/07/2018 00:00,DAILY,0,747
14215,COMMERCIAL ROAD, ,426467.93,435261.66,KIRKSTALL,METAL SQUARE,GOOD,NONE, ,12/07/2018 00:00,WED/SUN,0,748
14216,COMMON LANE, ,430221.78,426290.2,ARDSLEY & ROBIN HOOD, , , , ,12/07/2011 00:00, ,0,767
14217,FAIRBURN DRIVE,O/S SHOPS,441202.65,432380.01,GARFORTH & SWILLINGTON,METAL TWIN,FAIR,NONE,SHOP OWNED RED,16/04/2019 00:00,WEDNESDAY,0,1016
14218,FAIRBURN DRIVE,O/S SHOPS,441206.75,432387.63,GARFORTH & SWILLINGTON,METAL TWIN,FAIR,NONE,SHOP OWNED RED,16/04/2019 00:00,WEDNESDAY,0,1018
14219,GIBSON LANE, ,442018.63,430490.18,KIPPAX & METHLEY,METAL SQUARE,GOOD,NONE,GREEN,16/04/2019 00:00,TUESDAY,0,1089
14220,HIGH STREET, ,441703.93,430227.2,KIPPAX & METHLEY,IRON SQUARE,GOOD,NONE,GREEN,16/04/2019 00:00,TUESDAY,0,1442
14221,HIGH STREET,OPPOSITE NURSERY,441659.73,430231.01,KIPPAX & METHLEY,IRON SQUARE,GOOD,NONE,GREEN,16/04/2019 00:00,TUESDAY,0,1443
14222,HIGH STREET,O/S WILLIAM HILL,441626.68,430237.24,KIPPAX & METHLEY,IRON SQUARE,GOOD,NONE,GREEN,16/04/2019 00:00,TUESDAY,0,1444
14223,HIGH STREET, ,441816.14,430182.78,KIPPAX & METHLEY,IRON SQUARE,GOOD,NONE,GREEN,16/04/2019 00:00,TUESDAY,0,1465
14224,HIGH STREET, ,441793.24,430216.43,KIPPAX & METHLEY,IRON SQUARE,GOOD,NONE,GREEN,16/04/2019 00:00,TUESDAY,0,1466
14225,BLACK HILL ROAD,NEXT TO BENCH,427281.34,444640.81,OTLEY & YEADON,PLASTIC POST,POOR,NONE, ,12/06/2018 00:00,FRIDAY,0,6880
14226,GREEN HILL ROAD, ,425825.62,433748.46,ARMLEY,PLASTIC POST,POOR,ON FLOOR, ,12/08/2018 00:00,MON/THU/SAT,0,4654
17677,FAIRFIELD CRESCENT,CORNER OF FAIRFIELD ST,423779.89,434677,KIRKSTALL,METAL SQUARE,GOOD,NONE, ,13/08/2018 00:00,TUE/THU,0,8283
17678,NORTHCOTE DRIVE,ON FOOTPATH,429870.94,431933.26,HUNSLET & RIVERSIDE,METAL TWIN,POOR,NO DOOR, ,13/08/2018 00:00,TUESDAY,0,8917
17679,BURTON ROW, ,430395.8,431521.27,HUNSLET & RIVERSIDE,METAL SQUARE,GOOD,NONE, ,13/08/2018 00:00,TUESDAY,0,8922
17680,VIADUCT STREET, ,421903.71,434275.72,PUDSEY,METAL SQUARE,GOOD,NONE, ,13/08/2018 00:00,MONDAY,0,9873
17681,CARR ROAD,JCT WITH CARR WOOD GARDENS,420159.21,437099.45,PUDSEY,METAL TWIN,FAIR,NONE, ,13/08/2018 00:00,SATURDAY,0,10193
17682,CARR ROAD, ,419468.66,437007.67,PUDSEY,METAL SQUARE,GOOD,NONE, ,13/08/2018 00:00,SATURDAY,0,10194
17683,PARK SQUARE,FRONT OF RAISE FLOWER BED,422210.55,433298.81,PUDSEY,METAL TWIN,FAIR,NONE, ,13/08/2018 00:00,DAILY,0,10203
17684,BEZA STREET, ,430624.86,431239.49,HUNSLET & RIVERSIDE,METAL SQUARE,FAIR,NONE, ,12/09/2018 00:00,FRIDAY,0,10204
17685,DEWSBURY ROAD, ,430106.85,431368.99,HUNSLET & RIVERSIDE,METAL SQUARE,FAIR,NONE, ,12/09/2018 00:00,DAILY,0,10206
17686,DEWSBURY ROAD, ,430060.73,431434.63,HUNSLET & RIVERSIDE,METAL SQUARE,GOOD,NONE, ,12/09/2018 00:00,DAILY,0,10208
17687,DEWSBURY ROAD, ,430085.56,431498.5,HUNSLET & RIVERSIDE,METAL SQUARE,GOOD,NONE, ,12/09/2018 00:00,DAILY,0,10513
17688,GLENTHORPE CRESCENT,NR GRASSED AREA,432032.97,433662.61,BURMANTOFTS & RICHMOND HILL, , , , ,12/05/2018 00:00, ,0,4193
17521,BOGGART HILL DRIVE,CORNER OF BOGGART HILL RD,434324.74,436880.83,KILLINGBECK & SEACROFT, , , , ,12/05/2018 00:00, ,0,4553
17522,BOGGART HILL DRIVE, ,434613.67,436850.67,KILLINGBECK & SEACROFT, , , , ,12/05/2018 00:00, ,0,4556
17523,EASTERLY ROAD,NR DIB LANE,433973.9,436549.05,KILLINGBECK & SEACROFT, , , , ,12/05/2018 00:00, ,0,4557
17524,DIB LANE,O/S SHOPS,433888.18,436463.32,KILLINGBECK & SEACROFT, , , , ,12/05/2018 00:00, ,0,4561
17525,YORK ROAD,SLIP ROAD,435861.45,435355.24,KILLINGBECK & SEACROFT, , , , ,12/05/2018 00:00, ,0,4562
17526,POOLE CRESCENT,O/S SCHOOL,435597.92,434585.3,KILLINGBECK & SEACROFT, , , , ,12/05/2018 00:00, ,0,4573
17527,STATION ROAD,O/S SHOPS,436145.61,434561.49,KILLINGBECK & SEACROFT, , , , ,12/05/2018 00:00, ,0,4578
17528,INGLEWOOD DRIVE, ,435559.82,435088.54,KILLINGBECK & SEACROFT, , , , ,12/05/2018 00:00, ,0,4582
17529,WOODLEA, ,442711.97,445613.57,WETHERBY, , , , ,12/07/2011 00:00, ,0,3731
17530,HUNSLET HALL ROAD, ,430028.79,431794.75,HUNSLET & RIVERSIDE,METAL SQUARE,GOOD,NONE, ,12/09/2018 00:00,TUESDAY,0,10514
17531,LADY PITT LANE,CORNER FOLLY LN,429675.77,431656.38,HUNSLET & RIVERSIDE,METAL SQUARE,GOOD,NONE, ,12/09/2018 00:00,TUESDAY,0,10516
17532,FOLLY LANE, ,429707.7,431631.55,HUNSLET & RIVERSIDE,METAL SQUARE,GOOD,NONE, ,12/09/2018 00:00,TUESDAY,0,10517
17533,COUPLAND STREET, ,429752.05,431494.95,HUNSLET & RIVERSIDE,METAL TWIN,FAIR,RUSTING CORNER, ,12/09/2018 00:00,MONDAY,0,10518
17534,LADY PITT LANE, ,429840.75,431489.63,HUNSLET & RIVERSIDE,METAL SQUARE,GOOD,NONE, ,12/09/2018 00:00,MONDAY,0,10519