OBJECTID,ROAD_NAME,LOCATION,LOCATIONGROUP,EASTING,NORTHING,WARD,MODEL,APERTURE,FIXINGS,LINER,SIGNAGE,MAINCOLOUR,CONDITION,DEFECTS,ROUTE,COMMENTS,LASTUPDATED,UPDATEDBY,FREQUENCY,SEQUENCE,CREATED_USER,CREATED_DATE,LAST_EDITED_USER,LAST_EDITED_DATE
3930,WHITEHALL ROAD,BUS STOP,BUS STOP OR SHELTER,429128.140000000013970,433098.540000000037253,HUNSLET & RIVERSIDE,METAL SQUARE,POSTBOX 4 SIDES WITH SELF CLOSING ASHTRAY,500MM X 500MM BALLAST ONLY,120 LITRES,LCC LOGO DOG WASTE ACCEPTED,JET BLACK - RAL 9005,GOOD,NONE,CITY CENTRE MANAGEMENT,,22/09/2020 00:00:00,,DAILY,0.000000000000000,,,WAST,01/12/2021 15:32:00
3934,WHINMOOR,,GENERAL PATH - HIGH FOOT FALL,436414.799999999988358,436522.010000000009313,CROSSGATES & WHINMOOR,METAL SQUARE,POSTBOX 4 SIDES WITH SELF CLOSING ASHTRAY,500MM X 500MM BALLAST ONLY,120 LITRES,LCC LOGO DOG WASTE ACCEPTED,JET BLACK - RAL 9005,GOOD,NONE,,,16/04/2019 00:00:00,,MON/FRI,0.000000000000000,,,WAST,01/12/2021 15:32:00
3935,WHINMOOR CRESCENT,,GENERAL PATH - HIGH FOOT FALL,435328.830000000016298,437991.669999999983702,CROSSGATES & WHINMOOR,METAL SQUARE,POSTBOX 4 SIDES WITH SELF CLOSING ASHTRAY,500MM X 500MM BALLAST ONLY,120 LITRES,LCC LOGO DOG WASTE ACCEPTED,JET BLACK - RAL 9005,GOOD,NONE,,,01/06/2019 00:00:00,,DAILY,0.000000000000000,,,WAST,01/12/2021 15:32:00
3936,WHINMOOR WAY,OPP CO-OP,SHOPS/OFFICES,436756.710000000020955,436294.710000000020955,CROSSGATES & WHINMOOR,METAL SQUARE,POSTBOX 4 SIDES WITH SELF CLOSING ASHTRAY,500MM X 500MM BALLAST ONLY,120 LITRES,LCC LOGO DOG WASTE ACCEPTED,JET BLACK - RAL 9005,GOOD,NONE,,,01/06/2019 00:00:00,,MON/FRI,0.000000000000000,,,WAST,01/12/2021 15:32:00
3937,WHINMOOR WAY,OPP PARK ENTRANCE,MONUMENT/BENCH/POW/CAR PARK,436499.229999999981374,436505.880000000004657,CROSSGATES & WHINMOOR,METAL SQUARE,POSTBOX 4 SIDES WITH SELF CLOSING ASHTRAY,500MM X 500MM BALLAST ONLY,120 LITRES,LCC LOGO DOG WASTE ACCEPTED,JET BLACK - RAL 9005,GOOD,NONE,,,01/06/2019 00:00:00,,MON/FRI,0.000000000000000,,,WAST,01/12/2021 15:32:00
3938,WHITECOTE HILL,,GENERAL PATH - HIGH FOOT FALL,424144.760000000009313,435563.799999999988358,BRAMLEY & STANNINGLEY,METAL SQUARE,POSTBOX 4 SIDES WITH SELF CLOSING ASHTRAY,500MM X 500MM BALLAST ONLY,120 LITRES,LCC LOGO DOG WASTE ACCEPTED,JET BLACK - RAL 9005,GOOD,NONE,,,12/07/2018 00:00:00,,MON,0.000000000000000,,,WAST,01/12/2021 15:32:00
3939,WHITECOTE HILL,OPP WHITECOTE RISE,GENERAL PATH - HIGH FOOT FALL,423838.859999999986030,435607.950000000011642,BRAMLEY & STANNINGLEY,METAL TWIN,POSTBOX FRONT AND BACK,GROUND BOLTS,TWIN LINERS,LCC LOGO,GREY,FAIR,NONE,,,12/05/2018 00:00:00,,MON,0.000000000000000,,,WAST,01/12/2021 15:32:00
3940,WHITEHALL ROAD,BUS STOP,BUS STOP OR SHELTER,429041.840000000025611,433007.119999999995343,HUNSLET & RIVERSIDE,METAL SQUARE,POSTBOX 4 SIDES WITH SELF CLOSING ASHTRAY,500MM X 500MM BALLAST ONLY,120 LITRES,LCC LOGO DOG WASTE ACCEPTED,JET BLACK - RAL 9005,GOOD,NONE,CITY CENTRE MANAGEMENT,,22/09/2020 00:00:00,,DAILY,0.000000000000000,,,WAST,01/12/2021 15:32:00
3941,WHITEHALL ROAD,BUS STOP,BUS STOP OR SHELTER,428921.890000000013970,432945.679999999993015,HUNSLET & RIVERSIDE,METAL SQUARE,POSTBOX 4 SIDES WITH SELF CLOSING ASHTRAY,500MM X 500MM BALLAST ONLY,120 LITRES,LCC LOGO DOG WASTE ACCEPTED,JET BLACK - RAL 9005,GOOD,NONE,CITY CENTRE MANAGEMENT,,22/09/2020 00:00:00,,DAILY,0.000000000000000,,,WAST,01/12/2021 15:32:00
3942,WHITEHALL ROAD,JUST BEFORE BRIDGE,GENERAL PATH - HIGH FOOT FALL,429121.559999999997672,433066.359999999986030,HUNSLET & RIVERSIDE,METAL SQUARE,POSTBOX 4 SIDES WITH SELF CLOSING ASHTRAY,500MM X 500MM BALLAST ONLY,120 LITRES,LCC LOGO DOG WASTE ACCEPTED,JET BLACK - RAL 9005,GOOD,NONE,CITY CENTRE MANAGEMENT,,22/09/2020 00:00:00,,DAILY,0.000000000000000,,,WAST,01/12/2021 15:32:00
3943,WHITEHALL ROAD,CORNER OF BACK LN,GENERAL PATH - HIGH FOOT FALL,422525.090000000025611,429122.020000000018626,MORLEY NORTH,METAL SQUARE,POSTBOX 4 SIDES WITH LOCKING ASHTRAY,GROUND BOLTS,120 LITRES,NONE,BLACK,GOOD,NONE,,,29/05/2018 00:00:00,,MON,0.000000000000000,,,WAST,01/12/2021 15:32:00
3947,WHITFIELD WAY,,GENERAL PATH - HIGH FOOT FALL,431210.660000000032596,431772.650000000023283,HUNSLET & RIVERSIDE,METAL TWIN,POSTBOX FRONT AND BACK,GROUND BOLTS,TWIN LINERS,LCC LOGO,GREY,GOOD,NONE,,,12/09/2018 00:00:00,,WED,0.000000000000000,,,WAST,01/12/2021 15:32:00
3952,WHITEHALL ROAD,OPP STATION ROAD,GENERAL PATH - HIGH FOOT FALL,422294.535800000012387,428939.878299999982119,MORLEY NORTH,METAL SQUARE,POSTBOX 4 SIDES WITH LOCKING ASHTRAY,GROUND BOLTS,120 LITRES,NONE,BLACK,GOOD,NONE,,,29/05/2018 00:00:00,,MON,0.000000000000000,,,WAST,01/12/2021 15:32:00
3193,ST MARKS ROAD,OPP CHURCH,MONUMENT/BENCH/POW/CAR PARK,429498.760000000009313,435108.660000000032596,LITTLE LONDON & WOODHOUSE,METAL SQUARE,POSTBOX 4 SIDES WITH SELF CLOSING ASHTRAY,500MM X 500MM BALLAST ONLY,120 LITRES,LCC LOGO DOG WASTE ACCEPTED,JET BLACK - RAL 9005,GOOD,NONE,,,25/06/2018 00:00:00,,SUN,0.000000000000000,,,WAST,01/12/2021 15:32:10
3194,ST MARKS STREET,OPP WOODHOUSE FLATS,GENERAL PATH - HIGH FOOT FALL,429440.910000000032596,435088.770000000018626,LITTLE LONDON & WOODHOUSE,METAL SQUARE,POSTBOX 4 SIDES WITH SELF CLOSING ASHTRAY,500MM X 500MM BALLAST ONLY,120 LITRES,LCC LOGO DOG WASTE ACCEPTED,JET BLACK - RAL 9005,GOOD,NONE,,,22/09/2020 00:00:00,,SUN,0.000000000000000,,,WAST,01/12/2021 15:32:10
3195,ST PAULS STREET,NEXT TO BENCHES,MONUMENT/BENCH/POW/CAR PARK,429714.700000000011642,433627.729999999981374,LITTLE LONDON & WOODHOUSE,METAL SQUARE,POSTBOX 4 SIDES WITH SELF CLOSING ASHTRAY,500MM X 500MM BALLAST ONLY,120 LITRES,LCC LOGO DOG WASTE ACCEPTED,JET BLACK - RAL 9005,GOOD,NONE,CITY CENTRE MANAGEMENT,,22/09/2020 00:00:00,,DAILY,0.000000000000000,,,WAST,01/12/2021 15:32:10
3196,ST PAULS STREET,NEXT TO BENCHES,MONUMENT/BENCH/POW/CAR PARK,429714.700000000011642,433627.729999999981374,LITTLE LONDON & WOODHOUSE,METAL SQUARE,POSTBOX 4 SIDES WITH SELF CLOSING ASHTRAY,500MM X 500MM BALLAST ONLY,120 LITRES,LCC LOGO DOG WASTE ACCEPTED,JET BLACK - RAL 9005,GOOD,NONE,CITY CENTRE MANAGEMENT,,22/09/2020 00:00:00,,DAILY,0.000000000000000,,,WAST,01/12/2021 15:32:10
3197,SPEN GARDENS,,GENERAL PATH - HIGH FOOT FALL,426497.027899999986403,437862.556600000010803,WEETWOOD,METAL SQUARE,POSTBOX 4 SIDES WITH SELF CLOSING ASHTRAY,500MM X 500MM BALLAST ONLY,120 LITRES,LCC LOGO DOG WASTE ACCEPTED,JET BLACK - RAL 9005,GOOD,NONE,,,19/10/2020 00:00:00,,WED/SAT,0.000000000000000,,,WAST,01/12/2021 15:32:10
3198,SPEN LANE,,GENERAL PATH - HIGH FOOT FALL,426096.669999999983702,437111.630000000004657,KIRKSTALL,METAL TWIN,POSTBOX FRONT AND BACK,GROUND BOLTS,TWIN LINERS,LCC LOGO,GREY,FAIR,NO LOCK,,,12/07/2018 00:00:00,,MON/FRI,0.000000000000000,,,WAST,01/12/2021 15:32:10
3218,SELBY ROAD,,GENERAL PATH - HIGH FOOT FALL,439182.030000000027940,432145.030000000027940,GARFORTH & SWILLINGTON,METAL SQUARE,POSTBOX 4 SIDES WITH SELF CLOSING ASHTRAY,500MM X 500MM BALLAST ONLY,120 LITRES,LCC LOGO DOG WASTE ACCEPTED,JET BLACK - RAL 9005,GOOD,NONE,,,16/04/2019 00:00:00,,WED,0.000000000000000,,,WAST,01/12/2021 15:32:10
3219,ST CLAIR ROAD,,GENERAL PATH - HIGH FOOT FALL,420994.630000000004657,445257.619999999995343,OTLEY & YEADON,METAL TWIN,POSTBOX FRONT AND BACK,GROUND BOLTS,TWIN LINERS,LCC LOGO,GREY,FAIR,NONE,,,11/06/2018 00:00:00,,MON,0.000000000000000,,,WAST,01/12/2021 15:32:10
3220,ST GEORGES ROAD,,GENERAL PATH - HIGH FOOT FALL,430978.530000000027940,427993.150000000023283,MIDDLETON PARK,METAL SQUARE,POSTBOX 4 SIDES WITH SELF CLOSING ASHTRAY,500MM X 500MM BALLAST ONLY,120 LITRES,LCC LOGO DOG WASTE ACCEPTED,JET BLACK - RAL 9005,GOOD,NONE,,,30/07/2018 00:00:00,,WED/SAT,0.000000000000000,,,WAST,01/12/2021 15:32:10
3221,ST GEORGES ROAD,NR ASDA,SHOPS/OFFICES,431011.109999999986030,428004.000000000000000,MIDDLETON PARK,METAL SQUARE,POSTBOX 4 SIDES WITH SELF CLOSING ASHTRAY,500MM X 500MM BALLAST ONLY,120 LITRES,LCC LOGO DOG WASTE ACCEPTED,JET BLACK - RAL 9005,GOOD,NONE,,,12/05/2018 00:00:00,,WED/SAT,0.000000000000000,,,WAST,01/12/2021 15:32:10
4161,HARROGATE ROAD,ENT M&S,MONUMENT/BENCH/POW/CAR PARK,430746.679400000022724,438811.071200000005774,MOORTOWN,METAL SQUARE,POSTBOX 4 SIDES WITH SELF CLOSING ASHTRAY,500MM X 500MM BALLAST ONLY,120 LITRES,LITTER,JET BLACK - RAL 9005,FAIR,NONE,,,12/07/2018 00:00:00,,DAILY,0.000000000000000,WAST,17/01/2021 13:36:37,WAST,01/12/2021 15:32:02
4181,STAINBECK ROAD,AT CROSSING,SHOPS/OFFICES,430117.719800000020768,437537.699599999992643,MOORTOWN,METAL SQUARE,POSTBOX 4 SIDES WITH SELF CLOSING ASHTRAY,500MM X 500MM BALLAST ONLY,120 LITRES,LCC LOGO DOG WASTE ACCEPTED,JET BLACK - RAL 9005,GOOD,NONE,,,12/07/2019 00:00:00,,TUE/FRI,0.000000000000000,WAST,17/01/2021 14:58:31,WAST,01/12/2021 15:32:02
4182,STAINBECK ROAD,O/S DEFRESH,TAKEAWAY,430066.978899999987334,437516.148300000000745,MOORTOWN,METAL SQUARE,POSTBOX 4 SIDES WITH SELF CLOSING ASHTRAY,500MM X 500MM BALLAST ONLY,120 LITRES,LCC LOGO DOG WASTE ACCEPTED,JET BLACK - RAL 9005,GOOD,NONE,,,12/07/2019 00:00:00,,TUE/FRI,0.000000000000000,WAST,17/01/2021 14:59:35,WAST,01/12/2021 15:32:02
4183,STAINBECK ROAD,AT BUS STOP,BUS STOP OR SHELTER,429140.788000000000466,437068.690100000007078,MOORTOWN,METAL TWIN,POSTBOX FRONT AND BACK,GROUND BOLTS,TWIN LINERS,KEEP BRITAIN TIDY,GREY,FAIR,NONE,,,12/07/2018 00:00:00,,TUE/FRI,0.000000000000000,WAST,17/01/2021 15:17:37,WAST,01/12/2021 15:32:02
4184,STAINBECK ROAD,AT BUS STOP,BUS STOP OR SHELTER,429017.035199999983888,436900.462600000028033,MOORTOWN,METAL TWIN,POSTBOX FRONT AND BACK,GROUND BOLTS,TWIN LINERS,KEEP BRITAIN TIDY,GREY,FAIR,NONE,,,12/07/2018 00:00:00,,TUE/FRI,0.000000000000000,WAST,17/01/2021 15:23:12,WAST,01/12/2021 15:32:02
4185,STAINBECK ROAD,O/S NEEMS,TAKEAWAY,429024.208199999993667,436860.301099999982398,MOORTOWN,METAL SQUARE,POSTBOX 4 SIDES WITH SELF CLOSING ASHTRAY,500MM X 500MM BALLAST ONLY,120 LITRES,LCC LOGO DOG WASTE ACCEPTED,JET BLACK - RAL 9005,GOOD,NONE,,,12/07/2019 00:00:00,,TUE/FRI,0.000000000000000,WAST,17/01/2021 15:25:30,WAST,01/12/2021 15:32:02
4186,STAINBECK AVENUE,EDGE OF PARK,BUS STOP OR SHELTER,428803.834700000006706,436952.726599999994505,MOORTOWN,METAL TWIN,POSTBOX FRONT AND BACK,GROUND BOLTS,TWIN LINERS,KEEP BRITAIN TIDY,GREY,FAIR,NONE,,,12/07/2018 00:00:00,,TUE/FRI,0.000000000000000,WAST,17/01/2021 15:28:14,WAST,01/12/2021 15:32:02
4187,STAINBECK ROAD,AT BUS STOP,SHOPS/OFFICES,428692.856399999989662,436986.268400000000838,MOORTOWN,METAL SQUARE,POSTBOX 4 SIDES WITH SELF CLOSING ASHTRAY,500MM X 500MM BALLAST ONLY,120 LITRES,LCC LOGO DOG WASTE ACCEPTED,JET BLACK - RAL 9005,GOOD,NONE,,,12/07/2019 00:00:00,,TUE/FRI,0.000000000000000,WAST,17/01/2021 15:29:50,WAST,01/12/2021 15:32:02
4189,GREEN ROAD,ON PRECINCT,SHOPS/OFFICES,428593.268999999971129,437056.161399999982677,MOORTOWN,METAL SQUARE,POSTBOX 4 SIDES WITH SELF CLOSING ASHTRAY,500MM X 500MM BALLAST ONLY,120 LITRES,LCC LOGO DOG WASTE ACCEPTED,JET BLACK - RAL 9005,GOOD,NONE,,,12/07/2018 00:00:00,,DAILY,0.000000000000000,WAST,17/01/2021 16:03:59,WAST,01/12/2021 15:32:02
4190,GREEN ROAD,,SHOPS/OFFICES,428590.255200000014156,437060.948099999979604,MOORTOWN,METAL SQUARE,POSTBOX 4 SIDES WITH SELF CLOSING ASHTRAY,500MM X 500MM BALLAST ONLY,120 LITRES,LCC LOGO DOG WASTE ACCEPTED,JET BLACK - RAL 9005,GOOD,NONE,,,12/07/2018 00:00:00,,DAILY,0.000000000000000,WAST,17/01/2021 16:04:04,WAST,01/12/2021 15:32:02
4191,GREEN ROAD,AT BUS SHELTER,BUS STOP OR SHELTER,428598.764800000004470,437027.973300000012387,MOORTOWN,METAL SQUARE,POSTBOX 4 SIDES WITH SELF CLOSING ASHTRAY,500MM X 500MM BALLAST ONLY,120 LITRES,LCC LOGO DOG WASTE ACCEPTED,JET BLACK - RAL 9005,GOOD,NONE,,,12/07/2018 00:00:00,,DAILY,0.000000000000000,WAST,17/01/2021 16:04:28,WAST,01/12/2021 15:32:02
4192,GREEN ROAD,CNR MERMORIAL DR,GENERAL PATH - HIGH FOOT FALL,428522.799999999988358,437131.200000000011642,MOORTOWN,METAL SQUARE,POSTBOX 4 SIDES WITH SELF CLOSING ASHTRAY,500MM X 500MM BALLAST ONLY,120 LITRES,LCC LOGO DOG WASTE ACCEPTED,JET BLACK - RAL 9005,GOOD,NONE,,,12/07/2018 00:00:00,,DAILY,0.000000000000000,WAST,17/01/2021 16:07:28,WAST,01/12/2021 15:32:02
4193,GREEN ROAD,CNR SUNSET ROAD,GENERAL PATH - HIGH FOOT FALL,428338.350000000034925,437285.600000000034925,MOORTOWN,METAL SQUARE,POSTBOX 4 SIDES WITH SELF CLOSING ASHTRAY,500MM X 500MM BALLAST ONLY,120 LITRES,LCC LOGO DOG WASTE ACCEPTED,JET BLACK - RAL 9005,GOOD,NONE,,,12/07/2018 00:00:00,,DAILY,0.000000000000000,WAST,17/01/2021 16:10:11,WAST,01/12/2021 15:32:02
4194,GREEN LANE,PATH TO PARK,MONUMENT/BENCH/POW/CAR PARK,428149.766300000017509,437353.945799999986775,MOORTOWN,METAL TWIN,POSTBOX FRONT AND BACK,GROUND BOLTS,TWIN LINERS,KEEP BRITAIN TIDY,GREY,FAIR,NONE,,,12/07/2018 00:00:00,,DAILY,0.000000000000000,WAST,17/01/2021 16:13:34,WAST,01/12/2021 15:32:02
291,BOSTON ROAD,RIVER BANK,GENERAL PATH - HIGH FOOT FALL,440450.809200000017881,448011.784299999999348,WETHERBY,METAL SQUARE,POSTBOX 4 SIDES WITH SELF CLOSING ASHTRAY,500MM X 500MM BALLAST ONLY,120 LITRES,LCC LOGO DOG WASTE ACCEPTED,JET BLACK - RAL 9005,GOOD,NONE,,,17/10/2020 00:00:00,,MON,0.000000000000000,,,WAST,01/12/2021 15:32:12
292,BOSTON ROAD,RIVER BANK,GENERAL PATH - HIGH FOOT FALL,440433.606099999975413,448027.299999999988358,WETHERBY,METAL SQUARE,POSTBOX 4 SIDES WITH SELF CLOSING ASHTRAY,500MM X 500MM BALLAST ONLY,120 LITRES,LCC LOGO DOG WASTE ACCEPTED,JET BLACK - RAL 9005,GOOD,NONE,,,17/10/2020 00:00:00,,MON,0.000000000000000,,,WAST,01/12/2021 15:32:12
334,BRADFORD ROAD,NR BUS STOP,BUS STOP OR SHELTER,421172.169999999983702,434459.910000000032596,CALVERLEY & FARSLEY,METAL TWIN,POSTBOX FRONT AND BACK,GROUND BOLTS,TWIN LINERS,LCC LOGO,GREY,FAIR,NONE,,,13/08/2018 00:00:00,,MON/WED/SAT,0.000000000000000,,,WAST,01/12/2021 15:32:12
378,BRIDGE STREET,,GENERAL PATH - HIGH FOOT FALL,420221.162000000011176,445709.199800000002142,OTLEY & YEADON,METAL OPEN,OPEN TOP,GROUND BOLTS,80 LITRES,LCC LOGO,BLACK,POOR,NONE,,,11/06/2018 00:00:00,,DAILY,0.000000000000000,,,WAST,01/12/2021 15:32:12
382,BRIDGEFOOT,WILDERNESS CAR PARK,MONUMENT/BENCH/POW/CAR PARK,440491.328299999993760,447991.871199999994133,WETHERBY,METAL SQUARE,POSTBOX 4 SIDES WITH SELF CLOSING ASHTRAY,500MM X 500MM BALLAST ONLY,120 LITRES,LCC LOGO DOG WASTE ACCEPTED,JET BLACK - RAL 9005,GOOD,NONE,,,17/10/2020 00:00:00,,MON,0.000000000000000,,,WAST,01/12/2021 15:32:12
383,BRIDGEFOOT,WILDERNESS CAR PARK,MONUMENT/BENCH/POW/CAR PARK,440487.010999999998603,447995.663600000028964,WETHERBY,METAL SQUARE,POSTBOX 4 SIDES WITH SELF CLOSING ASHTRAY,500MM X 500MM BALLAST ONLY,120 LITRES,LCC LOGO DOG WASTE ACCEPTED,JET BLACK - RAL 9005,GOOD,NONE,,,17/10/2020 00:00:00,,MON,0.000000000000000,,,WAST,01/12/2021 15:32:12
637,CHAPEL LANE,O/S SCHOOL,SCHOOL/NURSERY,425045.470000000030268,432218.359999999986030,FARNLEY & WORTLEY,METAL SQUARE,POSTBOX 4 SIDES WITH SELF CLOSING ASHTRAY,500MM X 500MM BALLAST ONLY,120 LITRES,LCC LOGO DOG WASTE ACCEPTED,JET BLACK - RAL 9005,GOOD,NONE,P1,,12/10/2021 00:00:00,,MON/WED/SAT,125.000000000000000,,,WAST,01/12/2021 15:32:12
640,CHAPEL LANE,O/S SCHOOL,SCHOOL/NURSERY,425075.239999999990687,432284.739999999990687,FARNLEY & WORTLEY,METAL SQUARE,POSTBOX 4 SIDES WITH SELF CLOSING ASHTRAY,500MM X 500MM BALLAST ONLY,120 LITRES,LCC LOGO DOG WASTE ACCEPTED,JET BLACK - RAL 9005,GOOD,NONE,P1,,12/10/2021 00:00:00,,MON/WED/SAT,124.000000000000000,,,WAST,01/12/2021 15:32:12
683,BOROUGHGATE,CNR WESLEY ST,GENERAL PATH - HIGH FOOT FALL,420325.094999999972060,445555.281200000026729,OTLEY & YEADON,METAL SQUARE,POSTBOX 4 SIDES WITH SELF CLOSING ASHTRAY,500MM X 500MM BALLAST ONLY,120 LITRES,LCC LOGO DOG WASTE ACCEPTED,JET BLACK - RAL 9005,GOOD,NONE,,,11/06/2018 00:00:00,,DAILY,0.000000000000000,,,WAST,01/12/2021 15:32:12
718,CLARENDON ROAD,,GENERAL PATH - HIGH FOOT FALL,429228.475500000000466,434975.209700000006706,LITTLE LONDON & WOODHOUSE,METAL TWIN,POSTBOX FRONT AND BACK,GROUND BOLTS,TWIN LINERS,LCC LOGO,GREY,POOR,NO LOCK,,,25/06/2018 00:00:00,,MON,0.000000000000000,,,WAST,01/12/2021 15:32:12
733,CLAYPIT LANE,,SHOPS/OFFICES,430069.258600000001024,434166.792100000020582,LITTLE LONDON & WOODHOUSE,METAL SQUARE,POSTBOX 4 SIDES WITH SELF CLOSING ASHTRAY,500MM X 500MM BALLAST ONLY,120 LITRES,LCC LOGO DOG WASTE ACCEPTED,JET BLACK - RAL 9005,GOOD,NONE,CITY CENTRE MANAGEMENT,,22/09/2020 00:00:00,,DAILY,0.000000000000000,,,WAST,01/12/2021 15:32:12
801,COMMERCIAL STREET,CLOSED STREET!!,GENERAL PATH - HIGH FOOT FALL,426530.612599999993108,427758.755599999974947,MORLEY SOUTH,METAL OPEN,OPEN TOP,GROUND BOLTS,90 LITRES,NONE,BLACK,GOOD,NONE,,,12/07/2011 00:00:00,,MON,0.000000000000000,,,WAST,01/12/2021 15:32:12
851,CORPORATION STREET,O/S HEALTH CNTR,GENERAL PATH - HIGH FOOT FALL,426057.903099999995902,427709.034999999974389,MORLEY SOUTH,METAL SQUARE,POSTBOX 4 SIDES WITH SELF CLOSING ASHTRAY,500MM X 500MM BALLAST ONLY,120 LITRES,LCC LOGO DOG WASTE ACCEPTED,JET BLACK - RAL 9005,GOOD,NONE,,,12/07/2011 00:00:00,,DAILY,0.000000000000000,,,WAST,01/12/2021 15:32:12
864,COTTINGLEY VALE,O/S SHOPS,GENERAL PATH - HIGH FOOT FALL,427557.054200000013225,430367.977699999988545,BEESTON & HOLBECK,METAL SQUARE,POSTBOX 4 SIDES WITH SELF CLOSING ASHTRAY,500MM X 500MM BALLAST ONLY,120 LITRES,LCC LOGO DOG WASTE ACCEPTED,JET BLACK - RAL 9005,GOOD,NONE,,,12/07/2011 00:00:00,,MON,0.000000000000000,,,WAST,01/12/2021 15:32:10
2514,NORTH LANE,,GENERAL PATH - HIGH FOOT FALL,427711.968300000007730,436090.226699999999255,HEADINGLEY & HYDE PARK,METAL SQUARE,POSTBOX 4 SIDES WITH SELF CLOSING ASHTRAY,500MM X 500MM BALLAST ONLY,120 LITRES,LCC LOGO,JET BLACK - RAL 9005,GOOD,NONE,,,27/05/2021 00:00:00,,DAILY,0.000000000000000,,,WAST,01/12/2021 15:32:10
2516,NORTH LANE,,GENERAL PATH - HIGH FOOT FALL,427676.011699999973644,436045.331599999975879,HEADINGLEY & HYDE PARK,METAL SQUARE,POSTBOX 4 SIDES WITH SELF CLOSING ASHTRAY,500MM X 500MM BALLAST ONLY,120 LITRES,LCC LOGO DOG WASTE ACCEPTED,JET BLACK - RAL 9005,GOOD,NONE,,,22/02/2019 00:00:00,,DAILY,0.000000000000000,,,WAST,01/12/2021 15:32:10
2519,NORTH LANE,,GENERAL PATH - HIGH FOOT FALL,427880.320000000006985,436195.989999999990687,HEADINGLEY & HYDE PARK,PLASTIC POST,POSTBOX FRONT,METAL STRAP,80 LITRES,LCC LOGO,YELLOW- RAL 1023,POOR,NONE,,,28/04/2021 00:00:00,,DAILY,0.000000000000000,,,WAST,01/12/2021 15:32:10
2520,NORTH LANE,O/S SAINSBURYS,SHOPS/OFFICES,427694.976699999999255,436090.974999999976717,HEADINGLEY & HYDE PARK,METAL SQUARE,POSTBOX 4 SIDES WITH SELF CLOSING ASHTRAY,500MM X 500MM BALLAST ONLY,120 LITRES,,JET BLACK - RAL 9005,GOOD,NONE,,,26/05/2021 23:00:00,,DAILY,0.000000000000000,,,WAST,01/12/2021 15:32:10
2521,NORTH LANE,O/S SUNTAN CNTR,SHOPS/OFFICES,427836.913300000014715,436177.430799999972805,HEADINGLEY & HYDE PARK,METAL SQUARE,POSTBOX 4 SIDES WITH SELF CLOSING ASHTRAY,500MM X 500MM BALLAST ONLY,120 LITRES,LCC LOGO DOG WASTE ACCEPTED,JET BLACK - RAL 9005,GOOD,NONE,,,12/07/2018 00:00:00,,DAILY,0.000000000000000,,,WAST,01/12/2021 15:32:10
2537,NORTH WEST,OPP HOSPITAL LN,BUS STOP OR SHELTER,425904.790000000037253,439431.390000000013970,WEETWOOD,METAL SQUARE,POSTBOX 4 SIDES WITH SELF CLOSING ASHTRAY,500MM X 500MM BALLAST ONLY,120 LITRES,LCC LOGO DOG WASTE ACCEPTED,JET BLACK - RAL 9005,GOOD,NONE,MON,,19/10/2020 00:00:00,,WED/SAT,23.000000000000000,,,WAST,01/12/2021 15:32:10
2593,OLD ROAD,FARSLEY,GENERAL PATH - HIGH FOOT FALL,421659.710000000020955,435014.780000000027940,CALVERLEY & FARSLEY,METAL SQUARE,POSTBOX 4 SIDES WITH SELF CLOSING ASHTRAY,500MM X 500MM BALLAST ONLY,120 LITRES,LCC LOGO DOG WASTE ACCEPTED,JET BLACK - RAL 9005,GOOD,NONE,,,19/10/2020 00:00:00,,SUN,0.000000000000000,,,WAST,01/12/2021 15:32:10
2594,OLD ROAD,,GENERAL PATH - HIGH FOOT FALL,421635.000000000000000,434467.790000000037253,CALVERLEY & FARSLEY,METAL TWIN,POSTBOX FRONT AND BACK,GROUND BOLTS,TWIN LINERS,LCC LOGO,GREY,FAIR,NONE,,,28/08/2018 00:00:00,,MON,0.000000000000000,,,WAST,01/12/2021 15:32:10
2595,OLD ROAD,,GENERAL PATH - HIGH FOOT FALL,421621.510000000009313,434920.169999999983702,CALVERLEY & FARSLEY,METAL SQUARE,POSTBOX 4 SIDES WITH SELF CLOSING ASHTRAY,500MM X 500MM BALLAST ONLY,120 LITRES,LCC LOGO DOG WASTE ACCEPTED,JET BLACK - RAL 9005,GOOD,NONE,,,19/10/2020 00:00:00,,SUN,0.000000000000000,,,WAST,01/12/2021 15:32:10
2596,OLD ROAD,,GENERAL PATH - HIGH FOOT FALL,421674.989999999990687,435044.290000000037253,CALVERLEY & FARSLEY,METAL SQUARE,POSTBOX 4 SIDES WITH SELF CLOSING ASHTRAY,500MM X 500MM BALLAST ONLY,120 LITRES,LCC LOGO DOG WASTE ACCEPTED,JET BLACK - RAL 9005,GOOD,NONE,,,19/10/2020 00:00:00,,SUN,0.000000000000000,,,WAST,01/12/2021 15:32:10
2597,OLD RUN ROAD,,GENERAL PATH - HIGH FOOT FALL,430607.450000000011642,430241.770000000018626,MIDDLETON PARK,METAL SQUARE,POSTBOX 4 SIDES WITH SELF CLOSING ASHTRAY,500MM X 500MM BALLAST ONLY,120 LITRES,LCC LOGO DOG WASTE ACCEPTED,JET BLACK - RAL 9005,GOOD,NONE,,,30/07/2018 00:00:00,,THU,0.000000000000000,,,WAST,01/12/2021 15:32:10
2598,PARK ROW,HSBC,SHOPS/OFFICES,429941.669999999983702,433621.369999999995343,LITTLE LONDON & WOODHOUSE,METAL SQUARE,POSTBOX 4 SIDES WITH SELF CLOSING ASHTRAY,500MM X 500MM BALLAST ONLY,120 LITRES,LCC LOGO DOG WASTE ACCEPTED,JET BLACK - RAL 9005,GOOD,NONE,CITY CENTRE MANAGEMENT,,22/09/2020 00:00:00,,DAILY,0.000000000000000,,,WAST,01/12/2021 15:32:10
2599,OLD RUN ROAD,O/S SCHOOL,SCHOOL/NURSERY,430580.000000000000000,430143.280000000027940,MIDDLETON PARK,METAL SQUARE,POSTBOX 4 SIDES WITH SELF CLOSING ASHTRAY,500MM X 500MM BALLAST ONLY,120 LITRES,LCC LOGO DOG WASTE ACCEPTED,JET BLACK - RAL 9005,GOOD,NONE,,,12/05/2018 00:00:00,,THU,0.000000000000000,,,WAST,01/12/2021 15:32:10
2600,OLD RUN ROAD,O/S SCHOOL,SCHOOL/NURSERY,430519.580000000016298,430113.520000000018626,MIDDLETON PARK,METAL SQUARE,POSTBOX 4 SIDES WITH SELF CLOSING ASHTRAY,500MM X 500MM BALLAST ONLY,120 LITRES,LCC LOGO DOG WASTE ACCEPTED,JET BLACK - RAL 9005,GOOD,NONE,,,12/05/2018 00:00:00,,THU,0.000000000000000,,,WAST,01/12/2021 15:32:10
3222,ST GEORGES ROAD,NR BUS STOP,BUS STOP OR SHELTER,430993.070000000006985,428154.609999999986030,MIDDLETON PARK,METAL SQUARE,POSTBOX 4 SIDES WITH SELF CLOSING ASHTRAY,500MM X 500MM BALLAST ONLY,120 LITRES,LCC LOGO DOG WASTE ACCEPTED,JET BLACK - RAL 9005,GOOD,NONE,,,12/05/2018 00:00:00,,WED/SAT,0.000000000000000,,,WAST,01/12/2021 15:32:10
3223,ST GEORGES ROAD,O/S CENTRE,SHOPS/OFFICES,430974.130000000004657,428039.169999999983702,MIDDLETON PARK,METAL SQUARE,POSTBOX 4 SIDES WITH SELF CLOSING ASHTRAY,500MM X 500MM BALLAST ONLY,120 LITRES,LCC LOGO DOG WASTE ACCEPTED,JET BLACK - RAL 9005,GOOD,NONE,,,12/05/2018 00:00:00,,WED/SAT,0.000000000000000,,,WAST,01/12/2021 15:32:10
3224,ST JAMES CRESCENT,,GENERAL PATH - HIGH FOOT FALL,420886.650000000023283,433391.049999999988358,PUDSEY,METAL SQUARE,POSTBOX 4 SIDES WITH SELF CLOSING ASHTRAY,500MM X 500MM BALLAST ONLY,120 LITRES,LCC LOGO DOG WASTE ACCEPTED,JET BLACK - RAL 9005,GOOD,NONE,,,19/10/2020 00:00:00,,MON/WED/SAT,0.000000000000000,,,WAST,01/12/2021 15:32:10
3225,ST JAMES STREET,ENT TO CAR PARK,MONUMENT/BENCH/POW/CAR PARK,440257.200000000011642,448424.900000000023283,WETHERBY,METAL TWIN,POSTBOX FRONT AND BACK,GROUND BOLTS,TWIN LINERS,LCC LOGO,GREY,POOR,DOOR WONT LOCK,,,17/10/2020 00:00:00,,MON,0.000000000000000,,,WAST,01/12/2021 15:32:10
3226,ST JAMES STREET,O/S THE TANNING STUDIO,SHOPS/OFFICES,440467.340000000025611,448397.700000000011642,WETHERBY,METAL SQUARE,POSTBOX 4 SIDES WITH SELF CLOSING ASHTRAY,500MM X 500MM BALLAST ONLY,120 LITRES,LCC LOGO DOG WASTE ACCEPTED,JET BLACK - RAL 9005,FAIR,LOCK BROKEN,,,17/10/2020 00:00:00,,MON,0.000000000000000,,,WAST,01/12/2021 15:32:10
3227,SELBY ROAD,,GENERAL PATH - HIGH FOOT FALL,439801.479999999981374,432436.470000000030268,GARFORTH & SWILLINGTON,METAL SQUARE,POSTBOX 4 SIDES WITH SELF CLOSING ASHTRAY,500MM X 500MM BALLAST ONLY,120 LITRES,LCC LOGO DOG WASTE ACCEPTED,JET BLACK - RAL 9005,GOOD,NONE,,,16/04/2019 00:00:00,,WED,0.000000000000000,,,WAST,01/12/2021 15:32:10