OBJECTID,ROAD_NAME,LOCATION,LOCATIONGROUP,EASTING,NORTHING,WARD,MODEL,APERTURE,FIXINGS,LINER,SIGNAGE,MAINCOLOUR,CONDITION,DEFECTS,ROUTE,COMMENTS,LASTUPDATED,UPDATEDBY,FREQUENCY,SEQUENCE,CREATED_USER,CREATED_DATE,LAST_EDITED_USER,LAST_EDITED_DATE
3963,WILLOW CLOSE,ON PATH BETWEEN RADIO STATION AND WILLOW CL,GENERAL PATH - HIGH FOOT FALL,428306.53,434300.87,LITTLE LONDON & WOODHOUSE,METAL SQUARE,POSTBOX 4 SIDES WITH SELF CLOSING ASHTRAY,500MM X 500MM BALLAST ONLY,120 LITRES,LCC LOGO DOG WASTE ACCEPTED,JET BLACK - RAL 9005,GOOD,NONE,,,22/02/2019 00:00,,MONDAY,0,,,WAST,06/07/2021 21:05
3967,WINDMILL ROAD,,GENERAL PATH - HIGH FOOT FALL,431523.18,429688.68,MIDDLETON PARK,METAL SQUARE,POSTBOX 4 SIDES WITH SELF CLOSING ASHTRAY,500MM X 500MM BALLAST ONLY,120 LITRES,LCC LOGO DOG WASTE ACCEPTED,JET BLACK - RAL 9005,GOOD,NONE,,,12/07/2018 00:00,,DAILY,0,,,WAST,06/07/2021 21:05
3972,WINROSE CRESCENT,,GENERAL PATH - HIGH FOOT FALL,431121.19,430061.12,MIDDLETON PARK,METAL SQUARE,POSTBOX 4 SIDES WITH SELF CLOSING ASHTRAY,500MM X 500MM BALLAST ONLY,120 LITRES,LCC LOGO DOG WASTE ACCEPTED,JET BLACK - RAL 9005,GOOD,NONE,,,12/07/2018 00:00,,DAILY,0,,,WAST,06/07/2021 21:05
3833,WELLINGTON STREET,TASTY TOASTIES,TAKEAWAY,429360.78,433482.45,LITTLE LONDON & WOODHOUSE,METAL SQUARE,POSTBOX 4 SIDES WITH SELF CLOSING ASHTRAY,500MM X 500MM BALLAST ONLY,120 LITRES,LCC LOGO DOG WASTE ACCEPTED,JET BLACK - RAL 9005,FAIR,RUST,CITY CENTRE MANAGEMENT,,22/09/2020 00:00,,DAILY,0,,,WAST,06/07/2021 21:05
3835,WELLINGTON STREET,WELLINGTON HOUSE,SHOPS/OFFICES,429710.56,433431.36,LITTLE LONDON & WOODHOUSE,METAL SQUARE,POSTBOX 4 SIDES WITH SELF CLOSING ASHTRAY,500MM X 500MM BALLAST ONLY,120 LITRES,LCC LOGO DOG WASTE ACCEPTED,JET BLACK - RAL 9005,GOOD,NONE,CITY CENTRE MANAGEMENT,,22/09/2020 00:00,,DAILY,0,,,WAST,06/07/2021 21:05
3837,WELLSTONE AVENUE,,GENERAL PATH - HIGH FOOT FALL,423975.31,433774.44,PUDSEY,METAL SQUARE,POSTBOX 4 SIDES WITH SELF CLOSING ASHTRAY,500MM X 500MM BALLAST ONLY,120 LITRES,LCC LOGO DOG WASTE ACCEPTED,JET BLACK - RAL 9005,GOOD,NONE,,,19/10/2020 00:00,,THURSDAY,0,,,WAST,06/07/2021 21:05
3847,WESLEY STREET,CNR TOWN ST,GENERAL PATH - HIGH FOOT FALL,428650.3484,430807.9646,BEESTON & HOLBECK,METAL SQUARE,POSTBOX 4 SIDES WITH SELF CLOSING ASHTRAY,500MM X 500MM BALLAST ONLY,120 LITRES,LCC LOGO DOG WASTE ACCEPTED,JET BLACK - RAL 9005,GOOD,NONE,,,12/07/2011 00:00,,MONDAY,0,,,WAST,06/07/2021 21:05
3855,WEST GRANGE ROAD,,GENERAL PATH - HIGH FOOT FALL,430880.33,430130.65,MIDDLETON PARK,METAL SQUARE,POSTBOX 4 SIDES WITH SELF CLOSING ASHTRAY,500MM X 500MM BALLAST ONLY,120 LITRES,LCC LOGO DOG WASTE ACCEPTED,JET BLACK - RAL 9005,GOOD,NONE,,,12/05/2018 00:00,,THURSDAY,0,,,WAST,06/07/2021 21:05
3864,WESTERTON ROAD,AT BUS STOP,BUS STOP OR SHELTER,429059.4893,425467.1093,ARDSLEY & ROBIN HOOD,METAL SQUARE,POSTBOX 4 SIDES WITH SELF CLOSING ASHTRAY,500MM X 500MM BALLAST ONLY,120 LITRES,LCC LOGO DOG WASTE ACCEPTED,JET BLACK - RAL 9005,GOOD,NONE,,,12/07/2011 00:00,,WEEKLY,0,,,WAST,06/07/2021 21:05
3867,WESTFIELD GROVE,O/S NEWSAGENTS,SHOPS/OFFICES,441108.1,428345.46,KIPPAX & METHLEY,METAL SQUARE,POSTBOX 4 SIDES WITH SELF CLOSING ASHTRAY,500MM X 500MM BALLAST ONLY,120 LITRES,LCC LOGO DOG WASTE ACCEPTED,JET BLACK - RAL 9005,GOOD,NONE,,,16/04/2019 00:00,,SATURDAY,0,,,WAST,06/07/2021 21:05
3873,WESTGATE,,GENERAL PATH - HIGH FOOT FALL,419938.56,445400.81,OTLEY & YEADON,METAL TWIN,POSTBOX FRONT AND BACK,GROUND BOLTS,TWIN LINERS,LCC LOGO,GREY,FAIR,NONE,,,11/06/2018 00:00,,WED/FRI,0,,,WAST,06/07/2021 21:05
3874,WESTGATE,MANSIO RESIDENCE,SHOPS/OFFICES,429661.74,433782.74,LITTLE LONDON & WOODHOUSE,METAL SQUARE,POSTBOX 4 SIDES WITH SELF CLOSING ASHTRAY,500MM X 500MM BALLAST ONLY,120 LITRES,LCC LOGO DOG WASTE ACCEPTED,JET BLACK - RAL 9005,GOOD,NONE,CITY CENTRE MANAGEMENT,,22/09/2020 00:00,,DAILY,0,,,WAST,06/07/2021 21:05
3875,WEST GRANGE DRIVE,CORNER OF OLD RUN RD,GENERAL PATH - HIGH FOOT FALL,430768.22,430355.7,MIDDLETON PARK,METAL SQUARE,POSTBOX 4 SIDES WITH SELF CLOSING ASHTRAY,500MM X 500MM BALLAST ONLY,120 LITRES,LCC LOGO DOG WASTE ACCEPTED,JET BLACK - RAL 9005,GOOD,NONE,,,30/07/2018 00:00,,THURSDAY,0,,,WAST,06/07/2021 21:05
3880,WESTGATE,O/S LOOKSMART TAIOLORING,SHOPS/OFFICES,440313.56,448267.78,WETHERBY,METAL SQUARE,POSTBOX 4 SIDES WITH SELF CLOSING ASHTRAY,500MM X 500MM BALLAST ONLY,120 LITRES,LCC LOGO DOG WASTE ACCEPTED,JET BLACK - RAL 9005,GOOD,NONE,,,17/10/2020 00:00,,WEEKLY,0,,,WAST,06/07/2021 21:05
3881,WESTGATE,O/S NEW INN,PUB,440302.06,448286.6,WETHERBY,METAL SQUARE,POSTBOX 4 SIDES WITH SELF CLOSING ASHTRAY,500MM X 500MM BALLAST ONLY,120 LITRES,LCC LOGO DOG WASTE ACCEPTED,JET BLACK - RAL 9005,GOOD,NONE,,,17/10/2020 00:00,,,0,,,WAST,06/07/2021 21:05
3919,WETHERBY ROAD,SOUTHBOUND LAYBY,GENERAL PATH - HIGH FOOT FALL,439789.22,447159.5,WETHERBY,METAL SQUARE,POSTBOX 4 SIDES WITH SELF CLOSING ASHTRAY,500MM X 500MM BALLAST ONLY,120 LITRES,LCC LOGO DOG WASTE ACCEPTED,JET BLACK - RAL 9005,GOOD,NONE,,,17/10/2020 00:00,,WEEKLY,0,,,WAST,06/07/2021 21:05
3924,WETHERBY ROAD,WETHERBY BOUND LAYBY,GENERAL PATH - HIGH FOOT FALL,439831.04,447317.38,WETHERBY,METAL SQUARE,POSTBOX 4 SIDES WITH SELF CLOSING ASHTRAY,500MM X 500MM BALLAST ONLY,120 LITRES,LCC LOGO DOG WASTE ACCEPTED,JET BLACK - RAL 9005,GOOD,NONE,,,17/10/2020 00:00,,WEEKLY,0,,,WAST,06/07/2021 21:05
3925,WHINCOVER DRIVE,O/S RAMBLES,TAKEAWAY,425827.02,432193.89,FARNLEY & WORTLEY,METAL SQUARE,POSTBOX 4 SIDES WITH SELF CLOSING ASHTRAY,500MM X 500MM BALLAST ONLY,120 LITRES,LCC LOGO DOG WASTE ACCEPTED,JET BLACK - RAL 9005,GOOD,NONE,,,12/07/2011 00:00,,MON/THU/SAT,0,,,WAST,06/07/2021 21:05
3930,WHITEHALL ROAD,BUS STOP,BUS STOP OR SHELTER,429128.14,433098.54,HUNSLET & RIVERSIDE,METAL SQUARE,POSTBOX 4 SIDES WITH SELF CLOSING ASHTRAY,500MM X 500MM BALLAST ONLY,120 LITRES,LCC LOGO DOG WASTE ACCEPTED,JET BLACK - RAL 9005,GOOD,NONE,CITY CENTRE MANAGEMENT,,22/09/2020 00:00,,DAILY,0,,,WAST,06/07/2021 21:05
3934,WHINMOOR,,GENERAL PATH - HIGH FOOT FALL,436414.8,436522.01,CROSSGATES & WHINMOOR,METAL SQUARE,POSTBOX 4 SIDES WITH SELF CLOSING ASHTRAY,500MM X 500MM BALLAST ONLY,120 LITRES,LCC LOGO DOG WASTE ACCEPTED,JET BLACK - RAL 9005,GOOD,NONE,,,16/04/2019 00:00,,MON/FRI,0,,,WAST,06/07/2021 21:05
3937,WHINMOOR WAY,OPP PARK ENTRANCE,MONUMENT/BENCH/POW/CAR PARK,436499.23,436505.88,CROSSGATES & WHINMOOR,METAL SQUARE,POSTBOX 4 SIDES WITH SELF CLOSING ASHTRAY,500MM X 500MM BALLAST ONLY,120 LITRES,LCC LOGO DOG WASTE ACCEPTED,JET BLACK - RAL 9005,GOOD,NONE,,,01/06/2019 00:00,,MON/FRI,0,,,WAST,06/07/2021 21:05
3938,WHITECOTE HILL,,GENERAL PATH - HIGH FOOT FALL,424144.76,435563.8,BRAMLEY & STANNINGLEY,METAL SQUARE,POSTBOX 4 SIDES WITH SELF CLOSING ASHTRAY,500MM X 500MM BALLAST ONLY,120 LITRES,LCC LOGO DOG WASTE ACCEPTED,JET BLACK - RAL 9005,GOOD,NONE,,,12/07/2018 00:00,,MONDAY,0,,,WAST,06/07/2021 21:05
3945,WHITEHALL ROAD,AT BUS SHELTER,GENERAL PATH - HIGH FOOT FALL,425120.186,431094.2303,FARNLEY & WORTLEY,METAL SQUARE,POSTBOX 4 SIDES WITH SELF CLOSING ASHTRAY,500MM X 500MM BALLAST ONLY,120 LITRES,LCC LOGO DOG WASTE ACCEPTED,JET BLACK - RAL 9005,GOOD,NONE,,,12/07/2011 00:00,,MON/THU/SAT,0,,,WAST,06/07/2021 21:05
3947,WHITFIELD WAY,,GENERAL PATH - HIGH FOOT FALL,431210.66,431772.65,HUNSLET & RIVERSIDE,METAL TWIN,POSTBOX FRONT AND BACK,GROUND BOLTS,TWIN LINERS,LCC LOGO,GREY,GOOD,NONE,,,12/09/2018 00:00,,WEDNESDAY,0,,,WAST,06/07/2021 21:05
3953,WILLOW APPROACH,,GENERAL PATH - HIGH FOOT FALL,428195.34,434330.49,LITTLE LONDON & WOODHOUSE,METAL SQUARE,POSTBOX 4 SIDES WITH SELF CLOSING ASHTRAY,500MM X 500MM BALLAST ONLY,120 LITRES,LCC LOGO DOG WASTE ACCEPTED,JET BLACK - RAL 9005,GOOD,NONE,,,22/02/2019 00:00,,MONDAY,0,,,WAST,06/07/2021 21:05
3955,WIDE LANE,CORNER OF SOUTH QUEEN ST,GENERAL PATH - HIGH FOOT FALL,426510.94,427467.81,MORLEY SOUTH,METAL SQUARE,POSTBOX 4 SIDES WITH SELF CLOSING ASHTRAY,500MM X 500MM BALLAST ONLY,120 LITRES,LCC LOGO DOG WASTE ACCEPTED,JET BLACK - RAL 9005,GOOD,NONE,,,12/05/2018 00:00,,WEEKLY,0,,,WAST,06/07/2021 21:05
3973,WINROSE CRESCENT,,GENERAL PATH - HIGH FOOT FALL,431108.63,430032.87,MIDDLETON PARK,METAL SQUARE,POSTBOX 4 SIDES WITH SELF CLOSING ASHTRAY,500MM X 500MM BALLAST ONLY,120 LITRES,LCC LOGO DOG WASTE ACCEPTED,JET BLACK - RAL 9005,GOOD,NONE,,,12/07/2018 00:00,,DAILY,0,,,WAST,06/07/2021 21:05
3975,WOODHOUSE HILL ROAD,,GENERAL PATH - HIGH FOOT FALL,431228.02,430705.52,HUNSLET & RIVERSIDE,METAL SQUARE,POSTBOX 4 SIDES WITH SELF CLOSING ASHTRAY,500MM X 500MM BALLAST ONLY,120 LITRES,LCC LOGO DOG WASTE ACCEPTED,JET BLACK - RAL 9005,GOOD,NONE,,,12/09/2018 00:00,,FRI,0,,,WAST,06/07/2021 21:05
4034,WOODHOUSE LANE,WALKABOUT,PUB,430048.3,433971.17,LITTLE LONDON & WOODHOUSE,METAL SQUARE,POSTBOX 4 SIDES WITH SELF CLOSING ASHTRAY,500MM X 500MM BALLAST ONLY,120 LITRES,LCC LOGO DOG WASTE ACCEPTED,JET BLACK - RAL 9005,GOOD,NONE,CITY CENTRE MANAGEMENT,,22/09/2020 00:00,,DAILY,0,,,WAST,06/07/2021 21:05
4035,WOODHOUSE LANE,WOODHOUSE CARPARK SUBWAY,GENERAL PATH - HIGH FOOT FALL,429934.96,434327.89,LITTLE LONDON & WOODHOUSE,METAL SQUARE,POSTBOX 4 SIDES WITH SELF CLOSING ASHTRAY,500MM X 500MM BALLAST ONLY,120 LITRES,LCC LOGO DOG WASTE ACCEPTED,JET BLACK - RAL 9005,GOOD,NONE,CITY CENTRE MANAGEMENT,,22/09/2020 00:00,,DAILY,0,,,WAST,06/07/2021 21:05
4036,WOODHOUSE SQUARE,OS FORMER NIGHTCLUB,SHOPS/OFFICES,429334.46,434003.07,LITTLE LONDON & WOODHOUSE,METAL OPEN,OPEN TOP,GROUND BOLTS,80 LITRES,LCC LOGO,GREEN,POOR,NONE,CITY CENTRE MANAGEMENT,,26/06/2018 00:00,,MONDAY,0,,,WAST,06/07/2021 21:05
4048,WOODHOUSE STREET,,GENERAL PATH - HIGH FOOT FALL,429012.14,435505.22,HEADINGLEY & HYDE PARK,METAL SQUARE,POSTBOX 4 SIDES WITH SELF CLOSING ASHTRAY,500MM X 500MM BALLAST ONLY,120 LITRES,LCC LOGO DOG WASTE ACCEPTED,JET BLACK - RAL 9005,GOOD,NONE,,,30/04/2018 00:00,,DAILY,0,,,WAST,06/07/2021 21:05
4051,WOODLAND HILL,O/S SHOPS,SHOPS/OFFICES,435803.16,433984.95,TEMPLE NEWSAM,METAL SQUARE,POSTBOX 4 SIDES WITH SELF CLOSING ASHTRAY,500MM X 500MM BALLAST ONLY,120 LITRES,LCC LOGO DOG WASTE ACCEPTED,JET BLACK - RAL 9005,GOOD,NONE,,,01/06/2019 00:00,,DAILY,0,,,WAST,06/07/2021 21:05
4056,WOODSLEY ROAD,,GENERAL PATH - HIGH FOOT FALL,428587.79,434535.37,LITTLE LONDON & WOODHOUSE,METAL TWIN,POSTBOX FRONT AND BACK,GROUND BOLTS,TWIN LINERS,LCC LOGO,GREY,POOR,NO LOCK,,,25/06/2018 00:00,,MONDAY,0,,,WAST,06/07/2021 21:05
4057,WOODSLEY ROAD,O/S CHURCH,MONUMENT/BENCH/POW/CAR PARK,428618.76,434595.43,LITTLE LONDON & WOODHOUSE,METAL TWIN,POSTBOX FRONT AND BACK,GROUND BOLTS,TWIN LINERS,LCC LOGO,GREY,FAIR,NO LOCK,,,22/02/2019 00:00,,MONDAY,0,,,WAST,06/07/2021 21:05
4069,YORK ROAD,AT BUS STOP,BUS STOP OR SHELTER,440663.9665,448602.2141,WETHERBY,METAL SQUARE,POSTBOX 4 SIDES WITH SELF CLOSING ASHTRAY,500MM X 500MM BALLAST ONLY,120 LITRES,LCC LOGO DOG WASTE ACCEPTED,JET BLACK - RAL 9005,GOOD,NONE,,,17/10/2020 00:00,,WEEKLY,0,,,WAST,06/07/2021 21:05
4081,YORK ROAD,AT BUS SHELTER,BUS STOP OR SHELTER,435722.56,436006.87,KILLINGBECK & SEACROFT,METAL SQUARE,POSTBOX 4 SIDES WITH SELF CLOSING ASHTRAY,500MM X 500MM BALLAST ONLY,120 LITRES,LCC LOGO DOG WASTE ACCEPTED,JET BLACK - RAL 9005,GOOD,NONE,,,12/07/2011 00:00,,DAILY,0,,,WAST,06/07/2021 21:05
4110,YORK STREET,OPP ALL BRASS WOODWIND,SHOPS/OFFICES,430970.94,433519.5,LITTLE LONDON & WOODHOUSE,METAL SQUARE,POSTBOX 4 SIDES WITH SELF CLOSING ASHTRAY,500MM X 500MM BALLAST ONLY,120 LITRES,LCC LOGO DOG WASTE ACCEPTED,JET BLACK - RAL 9005,GOOD,NONE,CITY CENTRE MANAGEMENT,,22/09/2020 00:00,,DAILY,0,,,WAST,06/07/2021 21:05
4113,CHAPELTOWN ROAD,OPP CAFE BLISS,SHOPS/OFFICES,430859.6559,435487.002,CHAPEL ALLERTON,METAL OPEN,OPEN TOP,MOUNTED ON POST WITH GROUND BOLTS,60 LITRES,LCC LOGO,JET BLACK - RAL 9005,GOOD,NONE,,,12/07/2018 00:00,,DAILY,0,WAST,17/01/2021 08:43,WAST,06/07/2021 21:05
4114,CHAPELTOWN ROAD,OPP CAFE BLISS,SHOPS/OFFICES,430851.5461,435469.0562,CHAPEL ALLERTON,METAL OPEN,OPEN TOP,MOUNTED ON POST WITH GROUND BOLTS,60 LITRES,LCC LOGO,JET BLACK - RAL 9005,GOOD,NONE,,,12/07/2018 00:00,,DAILY,0,WAST,17/01/2021 08:44,WAST,06/07/2021 21:05
4115,CHAPELTOWN ROAD,O/S COSTCUTTER,SHOPS/OFFICES,430895.9132,435560.9073,CHAPEL ALLERTON,METAL OPEN,OPEN TOP,MOUNTED ON POST WITH GROUND BOLTS,60 LITRES,LCC LOGO,JET BLACK - RAL 9005,GOOD,NONE,,,12/07/2018 00:00,,DAILY,0,WAST,17/01/2021 08:45,WAST,06/07/2021 21:05
4116,CHAPELTOWN ROAD,OPP CAFE BLISS,SHOPS/OFFICES,430840.7441,435453.4389,CHAPEL ALLERTON,METAL OPEN,OPEN TOP,MOUNTED ON POST WITH GROUND BOLTS,60 LITRES,LCC LOGO,JET BLACK - RAL 9005,GOOD,NONE,,,12/07/2018 00:00,,DAILY,0,WAST,17/01/2021 08:45,WAST,06/07/2021 21:05
4117,CHAPELTOWN ROAD,OPP CAFE BLISS,SHOPS/OFFICES,430804.1638,435377.6229,CHAPEL ALLERTON,METAL OPEN,OPEN TOP,MOUNTED ON POST WITH GROUND BOLTS,60 LITRES,LCC LOGO,JET BLACK - RAL 9005,GOOD,NONE,,,12/07/2018 00:00,,DAILY,0,WAST,17/01/2021 08:47,WAST,06/07/2021 21:05
4121,CHAPELTOWN ROAD,OPP CAFE BLISS,SHOPS/OFFICES,430908.4576,435603.3007,CHAPEL ALLERTON,METAL OPEN,OPEN TOP,MOUNTED ON POST WITH GROUND BOLTS,60 LITRES,LCC LOGO,JET BLACK - RAL 9005,GOOD,NONE,,,12/07/2018 00:00,,DAILY,0,WAST,17/01/2021 08:54,WAST,06/07/2021 21:05
4124,CHAPELTOWN ROAD,OPP CANTORS,SHOPS/OFFICES,430943.3827,435758.0823,CHAPEL ALLERTON,METAL WIRE,OPEN TOP,MOUNTED ON POST WITH GROUND BOLTS,60 LITRES,LCC LOGO,WOOD,FAIR,NONE,,,12/07/2018 00:00,,DAILY,0,WAST,17/01/2021 09:03,WAST,06/07/2021 21:05
5192,RING ROAD BEESTON PARK,AT BUS STOP,BUS STOP OR SHELTER,428977.8603,429561.2857,BEESTON & HOLBECK,METAL SQUARE,POSTBOX 4 SIDES WITH SELF CLOSING ASHTRAY,500MM X 500MM BALLAST ONLY,120 LITRES,LCC LOGO DOG WASTE ACCEPTED,JET BLACK - RAL 9005,GOOD,NONE,,,12/07/2011 00:00,,WEEKLY,0,WAST,30/01/2021 15:16,WAST,06/07/2021 21:05
5201,DEWSBURY ROAD,O/S PIZZA PIZZA,TAKEAWAY,429316.7613,430132.0137,BEESTON & HOLBECK,METAL SQUARE,POSTBOX 4 SIDES WITH SELF CLOSING ASHTRAY,500MM X 500MM BALLAST ONLY,120 LITRES,LCC LOGO DOG WASTE ACCEPTED,JET BLACK - RAL 9005,GOOD,NONE,,,12/07/2011 00:00,,WEEKLY,0,WAST,31/01/2021 09:43,WAST,06/07/2021 21:05
5203,DEWSBURY ROAD,O/S CUEDOS,BUS STOP OR SHELTER,429019.3292,429924.2137,BEESTON & HOLBECK,PLASTIC ROUND,OPEN TOP,GROUND BOLTS,TWIN LINERS,LCC LOGO,GREY,GOOD,NONE,,,12/07/2011 00:00,,WEEKLY,0,WAST,31/01/2021 09:48,WAST,06/07/2021 21:05
5204,DEWSBURY ROAD,OPP BAL NEWSAGENTS,SHOPS/OFFICES,429016.7605,429886.3244,BEESTON & HOLBECK,METAL TWIN,POSTBOX FRONT AND BACK,GROUND BOLTS,TWIN LINERS,LCC LOGO,GREY,GOOD,NONE,,,12/07/2011 00:00,,WEEKLY,0,WAST,31/01/2021 09:50,WAST,06/07/2021 21:05
1,A58,SLIPROAD BUS STOP,BUS STOP OR SHELTER,429135.64,433579.33,LITTLE LONDON & WOODHOUSE,METAL SQUARE,POSTBOX 4 SIDES WITH SELF CLOSING ASHTRAY,500MM X 500MM BALLAST ONLY,120 LITRES,LCC LOGO DOG WASTE ACCEPTED,JET BLACK - RAL 9005,GOOD,NONE,CITY CENTRE MANAGEMENT,,22/09/2020 00:00,,DAILY,0,,,WAST,06/07/2021 21:05
3044,SANDERLING WAY,,GENERAL PATH - HIGH FOOT FALL,430859.59,428302.52,MIDDLETON PARK,METAL SQUARE,POSTBOX 4 SIDES WITH SELF CLOSING ASHTRAY,500MM X 500MM BALLAST ONLY,120 LITRES,LCC LOGO DOG WASTE ACCEPTED,JET BLACK - RAL 9005,GOOD,NONE,,,12/05/2018 00:00,,THURSDAY,0,,,WAST,06/07/2021 21:05
3045,SANDERLING WAY,ON FOOTPATH LEADING TO SHELDRAKE DR,GENERAL PATH - HIGH FOOT FALL,430845.16,428270.05,MIDDLETON PARK,METAL SQUARE,POSTBOX 4 SIDES WITH SELF CLOSING ASHTRAY,500MM X 500MM BALLAST ONLY,120 LITRES,LCC LOGO DOG WASTE ACCEPTED,JET BLACK - RAL 9005,GOOD,NONE,,,12/05/2018 00:00,,THURSDAY,0,,,WAST,06/07/2021 21:05
3046,SOVEREIGN STREET,BT BUILDING,SHOPS/OFFICES,429976.81,433079.92,HUNSLET & RIVERSIDE,METAL SQUARE,POSTBOX 4 SIDES WITH SELF CLOSING ASHTRAY,500MM X 500MM BALLAST ONLY,120 LITRES,LCC LOGO DOG WASTE ACCEPTED,JET BLACK - RAL 9005,GOOD,NONE,CITY CENTRE MANAGEMENT,,22/09/2020 00:00,,DAILY,0,,,WAST,06/07/2021 21:05
3047,SANDFORD ROAD,,GENERAL PATH - HIGH FOOT FALL,426569.85,435362.63,KIRKSTALL,METAL TWIN,POSTBOX FRONT AND BACK,GROUND BOLTS,TWIN LINERS,LCC LOGO,GREY,GOOD,NONE,,,12/07/2018 00:00,,WED/SUN,0,,,WAST,06/07/2021 21:05
3048,SOVEREIGN STREET,KPMG CORNER,SHOPS/OFFICES,429976.81,433079.92,HUNSLET & RIVERSIDE,METAL SQUARE,POSTBOX 4 SIDES WITH SELF CLOSING ASHTRAY,500MM X 500MM BALLAST ONLY,120 LITRES,LCC LOGO DOG WASTE ACCEPTED,JET BLACK - RAL 9005,GOOD,NONE,CITY CENTRE MANAGEMENT,,22/09/2020 00:00,,DAILY,0,,,WAST,06/07/2021 21:05
3051,SAVILLE GREEN,O/S SHOPS,SHOPS/OFFICES,431907.72,433699.89,BURMANTOFTS & RICHMOND HILL,METAL SQUARE,POSTBOX 4 SIDES WITH SELF CLOSING ASHTRAY,500MM X 500MM BALLAST ONLY,120 LITRES,LCC LOGO DOG WASTE ACCEPTED,JET BLACK - RAL 9005,GOOD,NONE,,,12/07/2011 00:00,,WEEKLY,0,,,WAST,06/07/2021 21:05
3052,SAVILLE ROAD,AT BUS SHELTER,BUS STOP OR SHELTER,439704.47,427095.65,KIPPAX & METHLEY,METAL TWIN,POSTBOX FRONT AND BACK,GROUND BOLTS,TWIN LINERS,LCC LOGO,GREY,FAIR,NONE,,,16/04/2019 00:00,,SUNDAY,0,,,WAST,06/07/2021 21:05
3053,SAVILLE ROAD,,GENERAL PATH - HIGH FOOT FALL,439989.5,427154.77,KIPPAX & METHLEY,METAL TWIN,POSTBOX FRONT AND BACK,GROUND BOLTS,TWIN LINERS,LCC LOGO,GREY,FAIR,NONE,,,16/04/2019 00:00,,SUNDAY,0,,,WAST,06/07/2021 21:05
3054,ROYDS LANE,,GENERAL PATH - HIGH FOOT FALL,435236.32,427603.19,ROTHWELL,METAL SQUARE,POSTBOX 4 SIDES WITH SELF CLOSING ASHTRAY,500MM X 500MM BALLAST ONLY,120 LITRES,LCC LOGO DOG WASTE ACCEPTED,JET BLACK - RAL 9005,GOOD,NONE,,,22/09/2020 00:00,,DAILY,0,,,WAST,06/07/2021 21:05
3055,SAVILLE ROAD,O/S NO. 38,GENERAL PATH - HIGH FOOT FALL,439730.35,427100.72,KIPPAX & METHLEY,METAL OPEN,OPEN TOP,GROUND BOLTS,80 LITRES,LCC LOGO,,FAIR,NONE,,,16/04/2019 00:00,,SUNDAY,0,,,WAST,06/07/2021 21:05
3056,SAVILLE ROAD,O/S LIBRARY,SHOPS/OFFICES,439781.67,427109.73,KIPPAX & METHLEY,METAL TWIN,POSTBOX FRONT AND BACK,GROUND BOLTS,TWIN LINERS,LCC LOGO,GREY,FAIR,NONE,,,16/04/2019 00:00,,SUNDAY,0,,,WAST,06/07/2021 21:05
3057,SAVILLE ROAD,O/S SCHOOL,SCHOOL/NURSERY,439958.06,427144.57,KIPPAX & METHLEY,METAL TWIN,POSTBOX FRONT AND BACK,GROUND BOLTS,TWIN LINERS,LCC LOGO,GREY,FAIR,NONE,,,16/04/2019 00:00,,SUNDAY,0,,,WAST,06/07/2021 21:05
3058,SAVILLE ROAD,O/S SCHOOL,SCHOOL/NURSERY,440010.24,427162.11,KIPPAX & METHLEY,METAL TWIN,POSTBOX FRONT AND BACK,GROUND BOLTS,TWIN LINERS,LCC LOGO,GREY,FAIR,NONE,,,16/04/2019 00:00,,SUNDAY,0,,,WAST,06/07/2021 21:05
3059,SAVINS MILL WAY,,GENERAL PATH - HIGH FOOT FALL,426211.85,435484.4,KIRKSTALL,METAL TWIN,POSTBOX FRONT AND BACK,GROUND BOLTS,TWIN LINERS,LCC LOGO,GREY,FAIR,NONE,,,12/07/2018 00:00,,DAILY,0,,,WAST,06/07/2021 21:05
3060,ROYDS LANE,,GENERAL PATH - HIGH FOOT FALL,434593.55,428148.43,ROTHWELL,METAL SQUARE,POSTBOX 4 SIDES WITH SELF CLOSING ASHTRAY,500MM X 500MM BALLAST ONLY,120 LITRES,LCC LOGO DOG WASTE ACCEPTED,JET BLACK - RAL 9005,GOOD,NONE,,,22/09/2020 00:00,,DAILY,0,,,WAST,06/07/2021 21:05
1335,HAIGH MOOR ROAD,AT BUS STOP,BUS STOP OR SHELTER,428657.0568,425344.157,ARDSLEY & ROBIN HOOD,METAL SQUARE,POSTBOX 4 SIDES WITH SELF CLOSING ASHTRAY,500MM X 500MM BALLAST ONLY,120 LITRES,LCC LOGO DOG WASTE ACCEPTED,JET BLACK - RAL 9005,GOOD,NONE,,,12/07/2011 00:00,,WEEKLY,0,,,WAST,06/07/2021 21:05
1338,HAIGH MOOR ROAD,,GENERAL PATH - HIGH FOOT FALL,428459.968,424798.163,ARDSLEY & ROBIN HOOD,METAL SQUARE,POSTBOX 4 SIDES WITH SELF CLOSING ASHTRAY,500MM X 500MM BALLAST ONLY,120 LITRES,LCC LOGO DOG WASTE ACCEPTED,JET BLACK - RAL 9005,GOOD,NONE,,,12/07/2011 00:00,,WEEKLY,0,,,WAST,06/07/2021 21:05
1340,FARRAR LANE,CORNER RAYNELL DR,GENERAL PATH - HIGH FOOT FALL,426211.09,439868.39,ADEL & WHARFEDALE,METAL SQUARE,POSTBOX 4 SIDES WITH SELF CLOSING ASHTRAY,500MM X 500MM BALLAST ONLY,120 LITRES,LCC LOGO DOG WASTE ACCEPTED,JET BLACK - RAL 9005,GOOD,NONE,MON,,19/10/2020 00:00,,MON,30,,,WAST,06/07/2021 21:05
1341,HAIGH ROAD,,GENERAL PATH - HIGH FOOT FALL,434096.68,428883.78,ROTHWELL,METAL SQUARE,POSTBOX 4 SIDES WITH SELF CLOSING ASHTRAY,500MM X 500MM BALLAST ONLY,120 LITRES,LCC LOGO DOG WASTE ACCEPTED,JET BLACK - RAL 9005,GOOD,NONE,,,22/09/2020 00:00,,DAILY,0,,,WAST,06/07/2021 21:05
1342,HAIGH ROAD,,GENERAL PATH - HIGH FOOT FALL,434285.94,428869.72,ROTHWELL,METAL SQUARE,POSTBOX 4 SIDES WITH SELF CLOSING ASHTRAY,500MM X 500MM BALLAST ONLY,120 LITRES,LCC LOGO DOG WASTE ACCEPTED,JET BLACK - RAL 9005,GOOD,NONE,,,22/09/2020 00:00,,DAILY,0,,,WAST,06/07/2021 21:05
1344,HAIGH WOOD CRESCENT,,GENERAL PATH - HIGH FOOT FALL,424558.9346,439064.4362,WEETWOOD,METAL SQUARE,POSTBOX 4 SIDES WITH SELF CLOSING ASHTRAY,500MM X 500MM BALLAST ONLY,120 LITRES,LCC LOGO DOG WASTE ACCEPTED,JET BLACK - RAL 9005,GOOD,NONE,,,19/10/2020 00:00,,WED/SAT,0,,,WAST,06/07/2021 21:05
1345,HAIGH WOOD ROAD,AT BUS SHELTER,BUS STOP OR SHELTER,424490.7676,439054.1897,WEETWOOD,METAL SQUARE,POSTBOX 4 SIDES WITH SELF CLOSING ASHTRAY,500MM X 500MM BALLAST ONLY,120 LITRES,LCC LOGO DOG WASTE ACCEPTED,JET BLACK - RAL 9005,GOOD,NONE,,,19/10/2020 00:00,,MON/WED/SAT,0,,,WAST,06/07/2021 21:05
1346,HALF MILE LANE,,GENERAL PATH - HIGH FOOT FALL,422736.07,434747.83,BRAMLEY & STANNINGLEY,METAL SQUARE,POSTBOX 4 SIDES WITH SELF CLOSING ASHTRAY,500MM X 500MM BALLAST ONLY,120 LITRES,LCC LOGO DOG WASTE ACCEPTED,JET BLACK - RAL 9005,GOOD,NONE,,,12/07/2018 00:00,,TUE/THU,0,,,WAST,06/07/2021 21:05
1359,HALL PARK ORCHARD,,GENERAL PATH - HIGH FOOT FALL,441709.26,430039.51,KIPPAX & METHLEY,METAL SQUARE,POSTBOX 4 SIDES WITH SELF CLOSING ASHTRAY,500MM X 500MM BALLAST ONLY,120 LITRES,LCC LOGO DOG WASTE ACCEPTED,JET BLACK - RAL 9005,GOOD,NONE,,,16/04/2019 00:00,,TUESDAY,0,,,WAST,06/07/2021 21:05
1360,HUNSLET HALL ROAD,,GENERAL PATH - HIGH FOOT FALL,430028.79,431794.75,HUNSLET & RIVERSIDE,METAL SQUARE,POSTBOX 4 SIDES WITH SELF CLOSING ASHTRAY,500MM X 500MM BALLAST ONLY,120 LITRES,LCC LOGO DOG WASTE ACCEPTED,JET BLACK - RAL 9005,GOOD,NONE,,,12/09/2018 00:00,,TUESDAY,0,,,WAST,06/07/2021 21:05
1361,HALLFIELD LANE,O/S NEWSAGENTS,SHOPS/OFFICES,440990.3767,448288.6968,WETHERBY,PLASTIC ROUND,OPEN TOP,GROUND BOLTS,80 LITRES,LCC LOGO,BLACK,GOOD,NONE,,,17/10/2020 00:00,,WEEKLY,0,,,WAST,06/07/2021 21:05
1362,HALLFIELD LANE,NEXT TO BUS SHELTER AND BENCH,BUS STOP OR SHELTER,440931.6981,448581.9577,WETHERBY,PLASTIC POST,POSTBOX FRONT,METAL STRAP,80 LITRES,LCC LOGO,YELLOW- RAL 1023,FAIR,NONE,,,17/10/2020 00:00,,,0,,,WAST,06/07/2021 21:05
1363,HALLFIELD LANE,ON ISLAND,GENERAL PATH - HIGH FOOT FALL,440595.7752,448173.4174,WETHERBY,METAL SQUARE,POSTBOX 4 SIDES WITH SELF CLOSING ASHTRAY,500MM X 500MM BALLAST ONLY,120 LITRES,LCC LOGO DOG WASTE ACCEPTED,JET BLACK - RAL 9005,GOOD,NONE,,,17/10/2020 00:00,,WEEKLY,0,,,WAST,06/07/2021 21:05
1839,LAWNS LANE,ENT TO WAR MEMORIAL PARK,GENERAL PATH - HIGH FOOT FALL,424893.15,431779.6,FARNLEY & WORTLEY,METAL SQUARE,POSTBOX 4 SIDES WITH SELF CLOSING ASHTRAY,500MM X 500MM BALLAST ONLY,120 LITRES,LCC LOGO DOG WASTE ACCEPTED,JET BLACK - RAL 9005,FAIR,PAINT FADED,,,12/07/2011 00:00,,MON/THU/SAT,0,,,WAST,06/07/2021 21:05
1841,LEA FARM ROAD,,GENERAL PATH - HIGH FOOT FALL,425477.88,437506.03,KIRKSTALL,METAL SQUARE,POSTBOX 4 SIDES WITH SELF CLOSING ASHTRAY,500MM X 500MM BALLAST ONLY,120 LITRES,LCC LOGO DOG WASTE ACCEPTED,JET BLACK - RAL 9005,GOOD,NONE,,,12/07/2018 00:00,,MON/FRI,0,,,WAST,06/07/2021 21:05
1843,LEADWELL LANE,ENT TO PARK,GENERAL PATH - HIGH FOOT FALL,432813.2689,427538.9921,ARDSLEY & ROBIN HOOD,METAL SQUARE,POSTBOX 4 SIDES WITH SELF CLOSING ASHTRAY,500MM X 500MM BALLAST ONLY,120 LITRES,LCC LOGO DOG WASTE ACCEPTED,JET BLACK - RAL 9005,GOOD,NONE,,,12/07/2011 00:00,,WEEKLY,0,,,WAST,06/07/2021 21:05
1850,LEDGARD WAY,NR BUS STOP,BUS STOP OR SHELTER,427292.47,433684.96,ARMLEY,METAL SQUARE,POSTBOX 4 SIDES WITH SELF CLOSING ASHTRAY,500MM X 500MM BALLAST ONLY,120 LITRES,LCC LOGO DOG WASTE ACCEPTED,JET BLACK - RAL 9005,GOOD,NONE,,,12/08/2018 00:00,,MON/THU/SAT,0,,,WAST,06/07/2021 21:05
1851,LEDGARD WAY,NR BUS STOP,BUS STOP OR SHELTER,427355.97,433759.57,ARMLEY,METAL SQUARE,POSTBOX 4 SIDES WITH SELF CLOSING ASHTRAY,500MM X 500MM BALLAST ONLY,120 LITRES,LCC LOGO DOG WASTE ACCEPTED,JET BLACK - RAL 9005,GOOD,NONE,,,12/08/2018 00:00,,MON/THU/SAT,0,,,WAST,06/07/2021 21:05